program: Gaussian 09
title: 000209717
version: EM64L-G09RevD.01
frameworkgroup: C1[X(C17H28O4)]
method: RPBEPBE
basis: SDD
operation: Freq
keyword: #pfreq=noraman
keyword: PBEPBE/SDD
title: #p freq=noraman PBEPBE/SDD
converged: NO YES NO NO
title: Mulliken charges:
elementType: O O O O C C C C C C C C C C C C C C C C C H H H H H H H H H H H H H H H H H H H H H H H H H H H H
charge: -0.310086 -0.275274 -0.455345 -0.259574 -0.213518 -0.085502 0.326200 -0.082576 -0.556468 -0.084146 -0.142730 -0.080015 0.373401 -0.569264 -0.503604 -0.817089 -0.779114 -0.753317 -0.765417 0.282056 -0.773309 0.211869 0.279627 0.192257 0.229341 0.201955 0.216477 0.209758 0.272213 0.238552 0.225562 0.205938 0.248595 0.218012 0.232317 0.260153 0.220407 0.219621 0.213563 0.230865 0.201495 0.233555 0.205662 0.228679 0.228978 0.343682 0.237647 0.280966 0.236944
chargesum: 0.00000
title: Mulliken charges with hydrogens summed into heavy atoms:
elementType: O O O O C C C C C C C C C C C C C C C C C
charge: -0.310086 -0.275274 -0.111663 -0.259574 -0.001648 0.194125 0.326200 0.109682 -0.125172 0.132331 0.067028 0.192198 0.373401 -0.105150 -0.049072 -0.106607 -0.125523 -0.087402 -0.102097 0.282056 -0.017752
polarizability: 2.10725201e+02 -2.47935409e+00 1.89239779e+02 -3.26186059e+00 -5.80035025e+00 1.62023988e+02
1716.lowfreq: -16.3970 -13.4728 -0.0003 0.0002 0.0005 7.9652 34.5124 47.7176 60.3812
frequency: 34.3994 47.5399 60.3403 75.4562 99.8780 107.6847 134.1092 148.8284 170.3509 183.1414 189.2982 198.2234 214.6955 223.4393 234.5617 246.8469 254.6372 267.3567 280.2994 288.4754 311.6792 335.3889 347.8591 365.9750 373.7826 388.2336 401.2921 420.7217 450.8901 453.9739 477.0937 493.0531 511.9137 524.8737 555.7324 565.8104 609.3600 647.9869 668.2415 690.7215 754.0815 765.2632 784.0160 796.4190 833.5684 841.3178 858.0821 891.6827 906.7637 917.3135 922.1634 925.5833 930.8730 951.8455 958.8088 981.3875 988.1585 997.0225 1002.6031 1006.5011 1023.8046 1039.4397 1046.3633 1069.0412 1074.9486 1094.4956 1105.8230 1117.4895 1129.3329 1134.2318 1162.9748 1177.2191 1187.9979 1197.9413 1200.8368 1209.0058 1218.7542 1234.3221 1235.9286 1246.6071 1252.2824 1280.6458 1289.8140 1296.2782 1299.1279 1303.8908 1309.2023 1332.0119 1338.1960 1347.7853 1353.7718 1359.3021 1373.4142 1375.0407 1379.3063 1381.1276 1383.1652 1386.2925 1392.2714 1449.0751 1451.8788 1455.1329 1459.4890 1460.8939 1463.3262 1468.6547 1472.4198 1475.6683 1482.7519 1483.9373 1486.4145 1499.1397 1639.0166 2961.1114 2967.0349 2969.0240 2980.4302 2982.5598 2984.8182 2986.5670 2989.8377 2994.6207 3002.5638 3004.0666 3011.9337 3013.2892 3030.2764 3047.7334 3060.1566 3065.7547 3066.5421 3073.2544 3076.3329 3086.1125 3093.6697 3095.7764 3097.5900 3098.3401 3102.2385 3139.7853 3567.1983
redmass: 5.5597 3.0989 3.7343 2.9019 3.2326 3.6466 1.0789 3.2180 1.5865 1.5286 2.3030 1.5627 2.6519 1.4567 1.5773 3.1758 1.9771 3.2900 1.9336 2.3472 2.9846 3.0665 1.8586 1.8334 2.5401 2.9594 2.9563 2.8896 2.9231 2.7869 2.7792 3.4862 3.3658 3.8496 3.4559 3.5066 4.7703 3.4303 3.5977 3.3379 3.6138 2.6958 2.6903 3.1118 3.2937 3.6365 2.1128 3.1684 2.0929 1.8035 2.6659 2.3235 2.2075 2.7017 2.0483 2.0441 1.4714 2.1117 1.9377 2.0829 1.7513 1.8842 1.6619 1.9009 1.8628 2.0975 1.6849 2.5577 2.3317 1.9581 2.5814 1.4857 2.2420 2.3464 1.5301 2.4972 1.7028 1.3235 1.9666 1.5631 1.8193 1.5256 1.3019 1.3360 1.3761 1.4372 1.3420 1.5199 1.4846 1.3615 1.3870 1.4368 1.2679 1.2318 1.2535 1.3420 1.2684 1.2184 1.2170 1.0507 1.0526 1.0576 1.0698 1.0629 1.0702 1.0640 1.0617 1.0594 1.0519 1.0583 1.0585 1.0637 8.8342 1.0789 1.0720 1.0412 1.0818 1.0442 1.0669 1.0782 1.0433 1.0374 1.0365 1.0815 1.0664 1.0650 1.0849 1.0937 1.0986 1.1004 1.1005 1.1023 1.0977 1.0980 1.1001 1.0967 1.0991 1.0983 1.0981 1.1015 1.0654
irintensity: 1.5752 1.2967 0.8870 0.7776 2.9621 0.2933 0.3726 0.9593 1.8068 2.7289 5.2069 0.6374 0.0961 2.6379 7.8444 1.7292 1.5770 0.1416 64.0101 25.1464 1.6904 13.7470 49.7529 55.5315 18.8829 1.3879 1.3631 5.6663 1.0573 8.3139 1.9369 0.2499 5.6970 4.1468 0.3117 3.8140 8.4548 2.9437 2.8945 2.0890 1.6048 1.0040 0.8007 5.8357 4.1951 8.8568 5.6903 33.7455 6.1701 0.2915 15.8027 10.2648 0.0221 86.5779 42.1257 8.2823 4.8448 28.8906 53.4450 19.7586 4.0502 26.1748 11.8248 55.5524 32.1162 0.4074 14.9662 3.6474 1.2104 37.9553 14.6133 18.5398 9.1738 48.1915 5.3779 301.5128 9.2630 29.1521 5.1627 10.9661 2.7624 7.4324 9.2915 2.2124 10.4340 10.1647 10.0998 0.3942 5.9470 4.7381 5.3092 3.1315 28.1390 23.6439 39.6650 13.8513 13.8560 25.2882 26.0507 2.0000 13.2703 2.5924 9.2188 12.5164 17.3147 3.5577 13.7351 15.0148 19.9464 18.9696 4.9155 1.1074 194.4157 6.1365 14.6093 19.7048 52.5705 13.7174 19.3895 20.5865 59.3374 23.1516 6.0500 17.6654 54.1522 27.3067 8.6633 31.6071 64.9817 9.4547 44.5305 39.6281 9.7176 42.6512 15.3624 3.8257 32.8114 15.0062 39.5643 12.7181 2.5580
temp: 298.150 k
press: 1.00000 atm
elementType: 8 8 8 8 6 6 6 6 6 6 6 6 6 6 6 6 6 6 6 6 6 1 1 1 1 1 1 1 1 1 1 1 1 1 1 1 1 1 1 1 1 1 1 1 1 1 1 1 1
symmnumber: 1
zpe: 1110753.6 jmol-1
zpe.correction: 0.423064 hartree
zpe.thermalcorrener: 0.445072 hartree
zpe.thermalcorrenthalpy: 0.446017 hartree
zpe.thermalcorrgfe: 0.374262 hartree
zpe.sumelectzpe: -963.826629 hartree
zpe.sumelectthermal: -963.804620 hartree
zpe.sumelectthermalent: -963.803676 hartree
zpe.sumelectthermalfe: -963.875431 hartree
dipole: 2.2792 1.6065 -1.6399
dipole: 3.2350
quadrupole: -129.5961 -132.2367 -124.0654
quadrupole: -4.7649 0.7833 4.6237
quadrupole: -0.9634 -3.6040 4.5674 -4.7649 0.7833 4.6237
hfenergy: -964.2496928 hartree
pointgroup: C01 [X(C17H28O4)]
dipole: -0.9334012 0.1732103 -0.8477114 debye
polarizability: 194.1710021|-11.3379992|201.7983318|12.733243|0.5494669|166.0196333 unknown
InChI: InChI=1S/C17H28O4/c1-9-6-13(19)15-12(9)7-11-8-14(20-10(2)18)17(15,5)21-16(11,3)4/h9,11-15,19H,6-8H2,1-5H3
charge 0 multiplicity 1
49 atoms
O  -0.36563 1.791253 1.236678
O  2.001313 -0.59968 -0.49705
O  0.526621 -2.685311 1.168212
O  3.654033 -0.679754 1.156045
C  -0.850996 -0.574444 0.546914
C  -1.032682 -0.692485 -0.989669
C  0.243779 0.434436 1.029418
C  -0.51586 1.845241 -1.284905
C  -1.379339 0.623629 -1.715012
C  -2.047296 -1.867241 -1.148475
C  -0.812823 -2.069189 1.036288
C  1.420254 0.681174 0.024273
C  -0.936439 2.529002 0.05744
C  0.996946 1.491546 -1.232975
C  -1.546071 -2.878929 -0.07259
C  0.761458 0.136706 2.452595
C  -3.531862 -1.484971 -0.938985
C  -0.331115 3.949146 0.163194
C  -2.464397 2.628303 0.270005
C  3.090702 -1.181667 0.15414
C  3.450103 -2.487907 -0.515301
H  -1.785727 -0.169024 0.988122
H  -0.067128 -1.062005 -1.386964
H  -0.649697 2.618725 -2.068959
H  -2.44738 0.872269 -1.584871
H  -1.232097 0.471196 -2.803844
H  -1.953836 -2.31276 -2.158726
H  -1.326499 -2.151128 2.015892
H  2.220571 1.197869 0.585379
H  1.259136 0.894559 -2.125063
H  1.600296 2.414482 -1.284385
H  -2.366455 -3.494893 0.336779
H  -0.797331 -3.567244 -0.504389
H  -0.054157 -0.22772 3.101776
H  1.60156 -0.576715 2.452582
H  1.147053 1.074879 2.88561
H  -3.897304 -0.794743 -1.721108
H  -4.165124 -2.390783 -0.977665
H  -3.702024 -1.005871 0.044004
H  0.757357 3.944818 -0.014197
H  -0.806304 4.63387 -0.563687
H  -0.503598 4.343932 1.179211
H  -2.947257 3.162741 -0.57033
H  -2.936887 1.637767 0.369086
H  -2.664988 3.189361 1.199504
H  0.955022 -2.341783 1.991985
H  3.518963 -2.361947 -1.608628
H  2.638879 -3.209515 -0.308971
H  4.401457 -2.867192 -0.114786
