program: Gaussian 09
title: 000209671
version: EM64L-G09RevD.01
frameworkgroup: C1[X(C10H14ClN)]
method: RPBEPBE
basis: SDD
operation: Freq
keyword: #p
keyword: freq=noraman
keyword: PBEPBE/SDD
title: #p freq=noraman PBEPBE/SDD
converged: YES YES NO NO
title: Mulliken charges:
elementType: Cl N C C C C C C C C C C H H H H H H H H H H H H H H
charge: -0.076529 -0.562159 -0.202772 -0.129944 0.554001 -0.719569 -0.702283 -0.355423 -0.468147 -0.114005 -0.203904 -0.256353 0.191410 0.209517 0.215504 0.205630 0.261820 0.210869 0.237194 0.199338 0.252771 0.271420 0.258474 0.237226 0.229849 0.256067
chargesum: 0.00000
title: Mulliken charges with hydrogens summed into heavy atoms:
elementType: Cl N C C C C C C C C C C
charge: -0.076529 -0.037968 -0.011362 0.079573 0.554001 -0.036615 -0.054883 -0.096949 -0.230921 -0.114005 0.025945 -0.000286
polarizability: 1.55642066e+02 2.73949890e+00 1.26241472e+02 8.34579219e+00 -1.99490238e+00 8.27145248e+01
1716.lowfreq: -6.3160 -5.7375 0.0007 0.0013 0.0024 7.2100 35.8600 61.9081 80.4190
frequency: 35.5225 61.8819 80.4118 147.4984 186.3088 199.8459 209.4632 225.7781 244.0195 298.6837 301.3944 332.7043 381.8063 384.9674 424.8128 440.9672 480.6366 583.9292 600.8571 659.7117 670.9783 701.1753 781.9757 796.7142 836.2388 886.6418 904.6740 914.2125 965.3331 976.0074 984.2132 996.7070 1041.4081 1061.4950 1073.4502 1086.0473 1105.5104 1154.7816 1174.6956 1184.5010 1217.4651 1272.4713 1287.5980 1312.2495 1324.5889 1360.9723 1377.4149 1379.2600 1381.5186 1425.0280 1458.5109 1464.8552 1469.3093 1473.0913 1485.2837 1573.7820 1605.5912 1638.1243 2953.9282 2966.0910 2983.4640 2988.7568 3061.6308 3075.3492 3076.7997 3102.2641 3127.0482 3147.7389 3150.3614 3175.6663 3425.7733 3553.2172
redmass: 3.6538 3.1439 4.1512 4.7956 4.6495 1.2110 1.0469 1.5955 1.3885 3.7785 3.0719 3.8650 5.9368 2.7949 2.7275 2.9696 2.6061 4.7266 4.2225 1.7986 3.7504 2.0895 1.7002 1.8724 2.9717 1.5237 1.3706 1.7490 1.2237 1.3484 5.9509 1.6784 2.0582 1.9129 1.8811 1.7316 2.6575 2.1664 1.1570 1.4991 2.2342 1.3920 1.3499 1.3638 1.5418 1.3031 2.2317 1.3170 1.6072 2.3849 1.6415 1.0525 1.3350 1.0547 1.0552 6.2661 6.9481 1.0924 1.0822 1.0367 1.0378 1.0830 1.0986 1.0988 1.0993 1.0995 1.0873 1.0927 1.0931 1.0973 1.0451 1.0960
irintensity: 0.3607 0.1792 0.4022 0.5101 0.1634 38.1266 3.3892 11.6621 2.8417 0.2645 0.1849 15.5148 4.5939 6.4688 1.1201 5.8850 23.0821 0.6086 1.4324 183.6884 38.8437 33.2830 35.9235 20.2742 38.6588 13.9306 0.1808 3.8213 7.2029 1.0051 4.7844 2.0413 10.1431 20.0342 20.2430 2.4410 11.1687 36.8632 4.3441 4.6482 9.7472 2.8704 2.6464 2.3422 1.8479 6.1568 18.1133 4.6713 17.2227 22.4472 8.3921 4.6581 28.3222 9.3287 11.5085 44.6214 35.8078 36.5790 13.8973 25.3381 20.9307 42.6033 37.1242 42.3807 46.4526 13.6444 8.0388 15.6375 5.2181 6.7848 1.9562 0.4275
temp: 298.150 k
press: 1.00000 atm
elementType: 17 7 6 6 6 6 6 6 6 6 6 6 1 1 1 1 1 1 1 1 1 1 1 1 1 1
symmnumber: 1
zpe: 567467.5 jmol-1
zpe.correction: 0.216137 hartree
zpe.thermalcorrener: 0.229021 hartree
zpe.thermalcorrenthalpy: 0.229965 hartree
zpe.thermalcorrgfe: 0.176504 hartree
zpe.sumelectzpe: -903.358244 hartree
zpe.sumelectthermal: -903.345360 hartree
zpe.sumelectthermalent: -903.344416 hartree
zpe.sumelectthermalfe: -903.397877 hartree
dipole: 2.3313 1.6699 -1.1607
dipole: 3.0936
quadrupole: -77.3707 -74.6008 -83.5333
quadrupole: -3.6692 -4.2143 1.3059
quadrupole: 1.1309 3.9008 -5.0317 -3.6692 -4.2143 1.3059
hfenergy: -903.5743812 hartree
pointgroup: C01 [X(C10H14Cl1N1)]
dipole: -0.8224912 -0.8101129 -0.3855218 debye
dipolederiv: -0.4019556 -0.3005656 0.0630404 -0.3849787 -0.5993678 0.0797039 0.0757084 0.0749419 -0.099182 -0.7229193 0.1012698 0.1576187 0.1705487 -0.2010141 -0.1450935 0.1432102 -0.1557352 -0.6511072 0.0337321 0.0754858 0.0092136 0.1589069 0.1025696 -0.032636 -0.0236498 -0.0071354 0.010769 0.6554837 -0.0640129 -0.0606454 -0.1112482 0.193723 0.0572223 0.1443569 0.0628351 0.3582179 0.3930147 -0.0752874 -0.0528051 0.0020411 0.0547928 -0.005459 -0.1141909 0.0104779 -0.0592972 -0.1380435 0.028782 0.0069836 0.0157485 0.0649483 -0.0238825 -0.0234058 -0.0571393 -0.0455411 -0.0425565 0.0108856 0.011189 0.0753251 0.0654019 -0.0706663 0.040976 -0.0888895 -0.182481 -0.3561053 -0.1157377 0.0330849 -0.2333057 -0.1694858 0.046156 0.0386297 0.0287995 -0.1213698 -0.2221456 0.0689698 -0.0034895 0.1387149 -0.0035657 -0.028904 -0.0047431 -0.0124366 -0.1621065 0.5850745 0.4466207 -0.1249455 0.5672924 0.8841955 -0.1252114 -0.1483267 -0.1125165 -0.023937 0.1179168 0.020974 -0.0445092 -0.0449276 0.1256001 0.0035486 -0.049594 -0.0105398 -0.1133407 -0.1290983 -0.0995196 -0.0087296 -0.1197187 -0.3136859 0.0277341 0.0034023 0.0247961 -0.1372182 -0.0186821 -0.0575879 0.002376 -0.094767 -0.1551007 0.0009902 -0.0134583 -0.0264726 0.0292504 0.0021984 -0.0615588 0.0081733 -0.0653944 -0.1420641 -0.0011138 0.0102152 -0.0251744 0.0253898 0.0659658 0.050831 -0.1130012 0.0430179 0.0133681 0.1029229 -0.0860371 0.0569208 -0.096044 0.0605829 -0.1033256 -0.0088828 -0.0990696 -0.1069376 -0.0215459 0.0085572 0.0480839 0.0618516 -0.0809709 0.0205862 0.1126982 0.0319634 0.0882218 -0.0227283 0.1115362 -0.0169022 0.108887 -0.0245214 0.0601743 -0.1310475 0.0857294 0.0317205 0.0876193 -0.1208629 0.0523357 -0.0845389 -0.1479197 -0.0007889 0.1041199 -0.0135999 0.0601562 -0.0126681 0.117317 -0.0153029 0.0670137 0.0686554 -0.0554351 0.0020961 -0.064963 -0.1446876 -0.0242602 0.037671 0.0551554 0.0620755 0.1451718 -0.0016966 -0.016667 -0.0972569 -0.0045936 -0.0019655 -0.0599116 -0.050018 0.3068445 0.0715549 0.0129098 -0.0587826 -0.0350811 0.1803819 0.1079853 -0.2059203 0.1634851 0.1558973 0.0856289 0.0716219 0.0165805 0.0801041 -0.0084619 -0.0098299 0.0167558 -0.0112881 0.1408727 0.0159685 -0.1141583 0.0317547 -0.0865638 -0.0292789 0.0189104 0.0308409 0.0214299 0.1379603 0.0318412 0.0688256 0.0208933 0.0820266 -0.0890808 -0.0088288 0.0246935 -0.0085952 0.1502018 -0.0478715 0.0117376 0.0436833 -0.0005444 0.102245 0.0020001 0.0462302 -0.0011154 0.1609322 unknown
polarizability: 153.7147693|6.2469489|127.5691215|-10.8221536|-2.1998783|83.3141716 unknown
InChI: InChI=1S/C10H14ClN/c1-7(8(2)12)9-4-3-5-10(11)6-9/h3-8H,12H2,1-2H3
charge 0 multiplicity 1
26 atoms
Cl 3.131928 2.155512 -0.3979
N  -3.757872 0.404928 -0.146917
C  -1.508486 -0.289408 0.639524
C  -2.31847 0.398978 -0.512787
C  -0.018021 -0.405012 0.317857
C  -1.733721 0.434857 1.991615
C  -2.047447 -0.260036 -1.891418
C  0.769489 0.763211 0.128993
C  0.615016 -1.66941 0.215733
C  2.139274 0.636315 -0.155549
C  1.996161 -1.773326 -0.067209
C  2.780453 -0.613372 -0.25957
H  -1.912038 -1.321143 0.733641
H  -2.00302 1.461363 -0.557703
H  -1.269923 -0.126034 2.822974
H  -1.287609 1.446979 1.978273
H  -2.815695 0.542766 2.173255
H  -2.650298 0.232367 -2.677015
H  -0.983973 -0.195952 -2.182996
H  -2.328322 -1.331698 -1.867275
H  -4.172091 -0.536138 -0.158334
H  -4.317939 1.057214 -0.706764
H  0.319771 1.758196 0.208009
H  0.02114 -2.579297 0.361271
H  2.469832 -2.758416 -0.140302
H  3.849561 -0.677941 -0.479902
