program: Gaussian 09
title: 000209685
version: EM64L-G09RevD.01
frameworkgroup: C1[X(C16H32N2Si2)]
method: RPBEPBE
basis: SDD
operation: Freq
keyword: #p
keyword: freq=noraman
keyword: PBEPBE/SDD
title: #p freq=noraman PBEPBE/SDD
converged: YES YES NO NO
title: Mulliken charges:
elementType: Si Si N N C C C C C C C C C C C C C C C C H H H H H H H H H H H H H H H H H H H H H H H H H H H H H H H H
charge: 1.280665 1.280654 -0.574441 -0.574427 -0.793418 -0.793426 -0.161666 -0.161682 -1.048898 -1.000942 -1.048841 -1.000920 -0.320108 -0.320126 -0.323532 -0.324470 -0.324451 -0.323500 -0.377602 -0.377579 0.219970 0.215619 0.220010 0.215566 0.243075 0.240244 0.235829 0.229870 0.235829 0.238866 0.240243 0.235825 0.243077 0.235846 0.238848 0.229863 0.201079 0.221591 0.201082 0.221571 0.234521 0.221095 0.221087 0.234501 0.202303 0.173786 0.202319 0.173758 0.259043 0.271681 0.259038 0.271676
chargesum: 0.00000
title: Mulliken charges with hydrogens summed into heavy atoms:
elementType: Si Si N N C C C C C C C C C C C C C C C C
charge: 1.280665 1.280654 -0.043717 -0.043712 -0.357829 -0.357851 -0.161666 -0.161682 -0.329750 -0.296377 -0.329695 -0.296364 0.102562 0.102527 -0.089011 -0.103375 -0.103365 -0.088999 -0.001513 -0.001502
polarizability: 2.89704086e+02 1.24668656e-03 2.20887611e+02 -2.43180823e+00 -3.22049370e-02 2.08521783e+02
1716.lowfreq: -12.6030 -10.3064 -4.1595 -3.5597 -0.0022 -0.0021 -0.0016 11.5959 21.5686
frequency: -11.4907 11.5800 21.5574 26.6105 47.2547 50.8808 61.2092 68.1929 80.7475 83.6023 107.0112 110.3982 118.3343 119.1566 131.3530 132.0037 144.5304 145.7356 153.4822 177.0542 178.8730 183.0354 195.0421 205.8462 210.7900 240.1442 240.2735 246.2610 282.3962 294.8341 320.6818 343.2818 359.2531 382.1763 423.3362 429.2515 455.3352 510.4830 605.3474 608.4021 617.2660 630.3695 630.8237 693.4953 693.8728 695.1135 695.1224 715.0473 715.7933 728.0433 736.2369 785.2270 786.1968 801.3045 808.1899 822.6276 824.5865 827.8689 863.1103 877.9217 887.0134 898.8452 899.8931 944.8982 946.6093 962.5965 976.0825 997.5143 1000.3411 1013.1991 1036.8743 1037.0752 1073.7276 1085.3843 1086.1107 1110.2565 1110.8073 1111.2535 1123.3845 1181.6364 1181.7472 1208.6991 1230.5788 1230.8954 1269.2674 1269.2913 1288.3302 1288.3780 1290.9601 1291.2959 1297.6086 1300.1254 1306.6140 1320.1567 1322.6294 1322.8461 1379.4629 1379.9035 1380.2140 1434.8439 1434.8744 1444.6006 1444.6742 1445.9987 1446.4932 1454.2057 1454.2927 1457.3194 1457.4473 1468.3984 1468.7749 1476.4931 1489.4046 1489.4471 1535.8209 1591.4704 1637.3471 1637.8607 2861.2339 2861.2983 2956.0085 2956.0249 2966.7312 2966.9065 2977.8981 2977.9696 2980.3111 2980.3416 3004.4582 3004.5363 3009.9245 3009.9781 3044.9184 3044.9984 3079.7349 3079.8082 3081.2616 3081.4337 3085.6272 3085.6690 3086.1194 3086.1436 3094.0473 3094.1804 3121.6127 3126.7010 3449.7954 3449.8356 3577.3902 3577.4125
redmass: 4.0105 4.4957 4.1793 3.7254 2.1944 1.7154 2.3874 3.4445 3.2443 2.7140 3.0604 1.7621 1.0507 1.3803 1.6762 1.5579 1.2665 1.4103 2.9179 2.4737 2.5013 2.4748 2.6267 2.6494 2.2200 1.2758 1.2362 3.8925 3.9394 4.2808 3.8917 3.9527 4.8081 2.7352 3.2943 3.1421 4.8049 3.0686 1.3662 1.2998 3.2620 3.4123 6.8355 1.5799 1.7984 3.1161 2.4518 2.1152 2.2720 3.2323 2.8994 1.2203 1.2268 1.2744 1.4250 1.6493 1.4840 1.3915 1.2550 1.4773 1.5227 1.4877 1.4904 1.8044 1.8371 1.3158 1.4072 1.5856 1.4849 3.3762 3.4523 3.4550 7.0852 1.8142 1.8803 1.9055 1.8658 1.6162 2.2848 1.3184 1.3189 1.1277 1.4757 1.4750 1.2361 1.2354 1.1383 1.1294 1.1455 1.1582 1.2217 1.2086 1.2411 3.6933 1.3457 1.3411 1.4696 1.4324 2.9026 1.0785 1.0778 1.0554 1.0568 1.0604 1.0546 1.0518 1.0514 1.0538 1.0502 1.0760 1.0759 2.0295 1.0904 1.0904 5.9677 5.8595 1.0942 1.0942 1.0713 1.0713 1.0584 1.0584 1.0635 1.0635 1.0340 1.0340 1.0344 1.0344 1.0887 1.0887 1.0948 1.0947 1.1014 1.1014 1.0982 1.0983 1.0980 1.0980 1.0984 1.0985 1.0983 1.0982 1.0866 1.0872 1.0943 1.0961 1.0448 1.0447 1.0974 1.0974
irintensity: 0.1649 0.0445 0.0344 0.0667 0.3843 7.0663 0.5659 0.0543 0.0388 1.0731 0.0202 0.4772 0.0548 0.2108 0.0870 0.0372 0.3753 0.0882 0.3753 0.1323 5.2668 1.7911 5.7479 0.0881 27.2992 51.7921 54.3184 2.7364 6.6959 11.6821 0.0162 1.1767 0.6723 0.3236 2.8869 30.1935 43.1710 30.7098 84.4849 329.7065 0.1041 30.7879 0.1917 0.2342 23.8420 26.4942 13.5701 18.6926 0.5797 4.2487 10.7878 20.3887 9.3686 40.4164 22.1691 0.3704 43.3212 17.9516 5.3861 306.7909 22.8478 67.3250 103.4772 46.1173 0.0424 0.0478 0.0000 33.3151 5.0460 3.2092 0.5400 28.8519 0.3372 2.7128 0.1515 6.6307 52.8452 3.3709 71.0661 24.4658 0.5288 0.0214 11.3375 4.5908 2.0413 9.1446 4.8202 12.8656 34.8354 26.1564 8.2385 46.2569 0.1463 34.7796 0.4042 0.1929 0.5580 28.1476 9.1384 8.3075 2.5567 0.2858 8.8612 9.9676 0.9081 6.4560 12.0723 21.8638 2.1097 0.0022 5.4603 0.4418 7.5529 3.6759 0.0785 0.0429 30.4169 44.2115 74.2016 129.7545 18.8003 4.2181 58.4393 9.8161 18.1590 22.6080 18.1399 5.6673 64.7401 6.4742 7.5949 1.3263 135.7596 13.3372 1.8934 4.6646 74.5110 5.7200 13.3138 16.8942 20.4771 27.9475 2.1728 25.8293 51.8897 0.0324 1.6964 2.0099 0.0555 0.0961
temp: 298.150 k
press: 1.00000 atm
elementType: 14 14 7 7 6 6 6 6 6 6 6 6 6 6 6 6 6 6 6 6 1 1 1 1 1 1 1 1 1 1 1 1 1 1 1 1 1 1 1 1 1 1 1 1 1 1 1 1 1 1 1 1
symmnumber: 1
zpe: 1169508.4 jmol-1
zpe.correction: 0.445442 hartree
zpe.thermalcorrener: 0.473524 hartree
zpe.thermalcorrenthalpy: 0.474468 hartree
zpe.thermalcorrgfe: 0.384236 hartree
zpe.sumelectzpe: -1315.614266 hartree
zpe.sumelectthermal: -1315.586184 hartree
zpe.sumelectthermalent: -1315.585240 hartree
zpe.sumelectthermalfe: -1315.675473 hartree
dipole: -0.0008 0.3061 0.0000
dipole: 0.3061
quadrupole: -135.2667 -140.6985 -135.4115
quadrupole: -0.0049 8.9243 -0.0135
quadrupole: 1.8589 -3.5729 1.7140 -0.0049 8.9243 -0.0135
hfenergy: -1316.0597081 hartree
pointgroup: C01 [X(C16H32N2Si2)]
dipole: 0.0008246 -0.1204239 -0.0004051 debye
polarizability: 288.0847815|0.2339106|220.8880244|11.60509|0.1189346|210.1406735 unknown
InChI: InChI=1S/C16H32N2Si2/c1-19(2,13-5-11-17)15-7-9-16(10-8-15)20(3,4)14-6-12-18/h7-10H,5-6,11-14,17-18H2,1-4H3
charge 0 multiplicity 1
52 atoms
Si -3.263475 1.222518 -0.833352
Si 3.261526 1.24275 0.843015
N  -3.855313 -4.043086 0.27876
N  3.891483 -4.010755 -0.306899
C  -4.162279 -0.182935 0.127929
C  4.171253 -0.149846 -0.126614
C  -1.400669 1.203223 -0.36625
C  1.398944 1.211756 0.375648
C  -3.451948 0.972248 -2.721094
C  -4.02377 2.90572 -0.319313
C  3.451752 0.983505 2.729325
C  4.009013 2.934523 0.33839
C  -3.662676 -1.610522 -0.204899
C  3.681557 -1.583346 0.195324
C  -0.373827 1.206247 -1.350237
C  0.992659 1.211839 -0.987645
C  -0.994363 1.199385 0.997019
C  0.372123 1.202122 1.359608
C  -4.372803 -2.702448 0.624248
C  4.39996 -2.663929 -0.641542
H  -5.249978 -0.104082 -0.081883
H  -4.047099 0.009713 1.216018
H  5.258149 -0.064758 0.084904
H  4.055875 0.049747 -1.213435
H  -2.975451 0.033159 -3.056919
H  -4.521935 0.92494 -2.996025
H  -2.99861 1.808717 -3.284456
H  -5.109209 2.930716 -0.531069
H  -3.882247 3.088028 0.76203
H  -3.546678 3.738668 -0.867275
H  4.52202 0.942869 3.004212
H  2.991943 1.813395 3.297161
H  2.98237 0.038979 3.059867
H  3.864865 3.122304 -0.741671
H  3.526683 3.760744 0.891923
H  5.094505 2.965971 0.549008
H  -2.569118 -1.672501 -0.021584
H  -3.816451 -1.841767 -1.27652
H  2.588584 -1.65176 0.010839
H  3.836365 -1.821615 1.265266
H  -0.638891 1.202625 -2.415299
H  1.749206 1.21418 -1.784458
H  -1.750875 1.192033 1.793821
H  0.637186 1.195093 2.424654
H  -5.455356 -2.682536 0.390678
H  -4.273863 -2.441278 1.708218
H  5.482146 -2.63834 -0.40683
H  4.300155 -2.395093 -1.723562
H  -2.852669 -4.154959 0.463373
H  -4.400847 -4.821817 0.660909
H  2.889815 -4.128151 -0.493371
H  4.442763 -4.782693 -0.694546
