program: Gaussian 09
title: 000209706
version: EM64L-G09RevD.01
frameworkgroup: C1[X(C20H17NO4)]
method: RPBEPBE
basis: SDD
operation: Freq
keyword: #p
keyword: freq=noraman
keyword: PBEPBE/SDD
title: #p freq=noraman PBEPBE/SDD
converged: YES YES NO NO
title: Mulliken charges:
elementType: O O O O N C C C C C C C C C C C C C C C C C C C C H H H H H H H H H H H H H H H H H
charge: -0.260454 -0.257393 -0.270223 -0.266259 -0.002214 -0.519179 -0.028093 0.244182 -0.586248 0.510112 0.571805 -0.523105 0.166100 -0.566302 0.181328 -0.520817 0.149157 -0.512869 -0.404603 0.199707 0.162287 -0.334073 -0.205039 -0.783294 -0.204667 0.256298 0.209342 0.228944 0.217546 0.265505 0.261246 0.240918 0.256673 0.230238 0.246070 0.244708 0.238547 0.239503 0.242355 0.216407 0.227663 0.238190
chargesum: 0.00000
title: Mulliken charges with hydrogens summed into heavy atoms:
elementType: O O O O N C C C C C C C C C C C C C C C C C C C C
charge: -0.260454 -0.257393 -0.270223 -0.266259 -0.002214 -0.053539 -0.028093 0.244182 -0.139758 0.510112 0.571805 -0.257600 0.166100 -0.305056 0.181328 -0.279899 0.149157 -0.256196 -0.174365 0.199707 0.162287 -0.088003 0.278216 -0.085029 0.261187
polarizability: 3.01200430e+02 -5.53540878e+01 2.07156185e+02 3.10818199e+01 1.95978389e+01 2.10473253e+02
1716.lowfreq: -8.4161 -4.4321 -0.0003 0.0004 0.0005 6.9231 11.0143 17.5780 23.8312
frequency: 10.2191 16.9306 23.6727 60.3703 67.9430 78.1520 88.6196 101.6695 107.4614 128.8849 179.5780 203.5331 212.8172 227.1610 267.3294 284.2404 288.9540 304.0720 351.5724 362.9807 375.5672 386.8079 411.7751 426.6919 442.3093 479.3151 483.2840 522.8087 551.5739 585.2672 607.4280 615.2181 632.7447 650.7022 675.2666 684.6143 699.5442 708.2943 713.0879 726.1358 768.3045 775.4033 792.0325 808.6426 819.2646 836.3292 846.0576 850.5614 864.6928 875.6626 880.3574 899.5123 903.9639 923.0664 930.3742 960.6624 974.6070 978.0648 979.4958 1021.0900 1036.3659 1047.9441 1056.8662 1066.1875 1068.6416 1072.6134 1122.6397 1125.0340 1130.2672 1151.8150 1172.3220 1180.3250 1191.0147 1199.5725 1244.4077 1250.7409 1252.8373 1272.2986 1305.5312 1308.8140 1346.8976 1359.7105 1362.4011 1363.9801 1383.1032 1396.7386 1400.7751 1426.4196 1438.8406 1452.4271 1454.5195 1457.1292 1467.8474 1475.5435 1476.1654 1483.1508 1485.4500 1489.8502 1584.2186 1612.1773 1619.0422 1631.0775 1638.4519 2982.8685 2985.9803 2989.4909 2994.0471 3010.5821 3044.7755 3070.6300 3075.9346 3096.2478 3107.4598 3109.8308 3132.7102 3138.6232 3162.8105 3171.8086 3178.1119 3187.4511
redmass: 5.7745 5.9134 5.4649 2.5533 4.3806 3.8708 3.3792 2.7307 1.2513 5.8236 6.8610 4.8078 4.1928 5.9057 3.5202 4.0470 4.8578 2.8701 4.6031 5.3567 5.4027 4.4581 3.8157 3.1726 3.4505 3.4211 4.3592 4.5708 5.1504 5.5528 4.2099 6.2082 4.3821 3.8429 8.8301 8.5698 4.7199 6.3379 5.2367 4.0584 6.7251 6.0558 3.0781 1.4627 4.3888 7.1137 1.5466 3.6270 1.8882 1.8133 2.6799 2.1355 1.5853 2.4603 1.4813 3.7372 5.6466 2.7917 3.1799 2.3817 2.1976 1.5788 3.6985 2.8038 1.5570 1.5182 1.3622 1.1010 1.0692 1.2545 1.5979 1.6622 1.9937 1.3151 1.7662 3.8868 3.0819 1.4067 2.5731 1.3866 2.0189 1.4750 1.2827 2.7477 2.5677 1.4125 3.7565 4.5196 4.2433 2.5160 1.0771 1.4856 1.4145 1.1121 1.6811 1.1944 1.6227 2.4049 7.3027 7.7948 8.4702 8.2695 8.1324 1.0624 1.0364 1.0624 1.0620 1.0586 1.1018 1.0973 1.0972 1.1004 1.1083 1.1129 1.0898 1.0924 1.0930 1.0933 1.0955 1.0921
irintensity: 0.0889 0.0391 0.1319 9.8210 5.2771 4.2716 1.5509 9.8584 2.8462 0.5760 4.0074 2.8614 1.0896 2.4029 2.7878 0.3937 1.2021 0.9371 1.0157 1.3351 0.5882 1.3200 5.9744 3.1002 8.5008 0.6087 2.4286 3.1762 1.9939 2.3974 4.2483 5.5794 4.5494 5.1987 0.3588 0.2160 0.2594 3.2809 2.9842 4.8485 10.7610 15.9927 0.6648 48.3719 17.9495 28.7843 8.6154 34.2118 10.8100 20.4623 5.3929 8.1447 49.1349 2.3638 0.5536 45.4077 120.9181 41.8845 88.4266 11.1201 4.9226 10.8661 10.5964 14.6206 13.3801 9.0258 7.2915 0.6283 1.1487 9.8160 3.4285 38.7957 120.1365 15.2923 90.1082 127.4037 114.0495 5.5518 25.4300 2.8259 3.8325 2.3916 2.6431 37.6196 35.1612 6.0359 10.3529 18.2366 46.4299 117.6720 16.9757 115.5621 37.2657 9.2798 70.1601 14.0973 56.8640 44.1894 92.6973 3.9717 1.3952 0.6477 8.5927 16.6409 26.3068 130.3284 46.1856 132.7749 19.0089 14.3500 20.8974 18.6556 34.8884 28.9726 11.1514 15.1867 5.3658 3.5067 5.9696 2.9885
temp: 298.150 k
press: 1.00000 atm
elementType: 8 8 8 8 7 6 6 6 6 6 6 6 6 6 6 6 6 6 6 6 6 6 6 6 6 1 1 1 1 1 1 1 1 1 1 1 1 1 1 1 1 1
symmnumber: 1
zpe: 848955.4 jmol-1
zpe.correction: 0.323350 hartree
zpe.thermalcorrener: 0.344388 hartree
zpe.thermalcorrenthalpy: 0.345332 hartree
zpe.thermalcorrgfe: 0.270177 hartree
zpe.sumelectzpe: -1126.172388 hartree
zpe.sumelectthermal: -1126.151350 hartree
zpe.sumelectthermalent: -1126.150406 hartree
zpe.sumelectthermalfe: -1126.225560 hartree
dipole: 2.1626 -0.3016 1.1020
dipole: 2.4459
quadrupole: -135.2558 -138.8791 -137.6223
quadrupole: -9.2989 1.8780 6.0431
quadrupole: 1.9966 -1.6267 -0.3699 -9.2989 1.8780 6.0431
hfenergy: -1126.4957379 hartree
pointgroup: C01 [X(C20H17N1O4)]
dipole: -0.8548983 -0.0753194 0.4352618 debye
polarizability: 301.8457353|-36.8880062|223.157339|-50.8831692|-13.8621492|193.826794 unknown
InChI: InChI=1S/C20H17NO4/c1-12-6-14-8-19-20(25-11-24-19)9-15(14)16(21-12)4-2-13-3-5-17-18(7-13)23-10-22-17/h3,5-9H,2,4,10-11H2,1H3
charge 0 multiplicity 1
42 atoms
O  -4.558117 1.76435 0.886498
O  -5.143098 -0.466673 1.536789
O  3.21206 -0.566468 2.511944
O  5.306313 -0.316852 1.370638
N  0.28959 -0.865017 -1.988309
C  0.039381 1.555839 -1.982153
C  -0.461918 0.180392 -1.575382
C  -1.655136 0.012761 -0.774394
C  0.725918 2.35152 -0.817892
C  -2.022239 -1.339261 -0.388622
C  1.970231 1.671381 -0.265002
C  -2.478251 1.125229 -0.365805
C  -3.593594 0.84825 0.399851
C  -3.196887 -1.579179 0.411099
C  -3.945989 -0.48131 0.785981
C  -1.189402 -2.414793 -0.830848
C  -0.065069 -2.154911 -1.622742
C  1.882798 0.869239 0.911565
C  3.216197 1.812846 -0.927821
C  3.04785 0.239856 1.351951
C  4.279522 0.385626 0.680967
C  4.398652 1.173593 -0.465384
C  -5.464589 0.968935 1.752666
C  0.844402 -3.248174 -2.136665
C  4.58991 -1.112137 2.401383
H  0.772961 1.40579 -2.792322
H  -0.787884 2.172734 -2.385071
H  -0.004301 2.513154 -0.003332
H  0.990951 3.350837 -1.213933
H  -2.240429 2.148994 -0.660627
H  -3.47879 -2.594811 0.700933
H  -1.439794 -3.443912 -0.552296
H  0.936359 0.746853 1.446399
H  3.271201 2.431277 -1.831236
H  5.356478 1.293854 -0.977888
H  -6.506091 1.151968 1.446452
H  -5.271206 1.224566 2.810571
H  0.867237 -3.239979 -3.241712
H  1.880972 -3.072864 -1.79639
H  0.519796 -4.245654 -1.795548
H  4.533639 -2.16683 2.068459
H  5.102369 -0.991622 3.367927
