program: Gaussian 09
title: 000209656
version: EM64L-G09RevD.01
frameworkgroup: C1[X(C12H10O2S)]
method: RPBEPBE
basis: SDD
operation: Freq
keyword: #p
keyword: freq=noraman
keyword: PBEPBE/SDD
title: #p freq=noraman PBEPBE/SDD
converged: NO YES NO NO
title: Mulliken charges:
elementType: S O O C C C C C C C C C C C C H H H H H H H H H H
charge: 0.176328 -0.366812 -0.230541 0.142368 0.391264 0.127376 -0.290774 -0.045240 -0.275894 -0.356062 -0.356675 -0.225937 -0.225629 -0.737007 -0.239093 0.259612 0.233790 0.233593 0.223073 0.222984 0.246574 0.246572 0.248130 0.225262 0.372738
chargesum: 0.00000
title: Mulliken charges with hydrogens summed into heavy atoms:
elementType: S O O C C C C C C C C C C C C
charge: 0.176328 0.005926 -0.230541 0.142368 0.391264 0.127376 -0.290774 -0.045240 -0.016282 -0.122272 -0.123082 -0.002864 -0.002644 0.004268 -0.013831
polarizability: 2.16403528e+02 8.93771642e+00 1.34847199e+02 -9.12671428e-02 6.17567741e-01 1.04982434e+02
1716.lowfreq: -36.9021 -9.8032 -0.0010 0.0014 0.0021 3.0630 8.0117 36.8617 69.1514
frequency: -36.8939 36.7673 69.1371 93.7016 115.1269 141.4428 179.2595 192.8135 219.9899 246.9363 268.8785 352.8236 371.2073 398.3288 399.1075 461.6586 463.7640 491.0596 527.4990 546.5526 585.5096 615.8277 650.1945 666.9598 699.6250 736.8466 749.4655 812.3244 846.2199 887.6856 913.4704 959.1432 969.8080 988.7545 991.2880 1013.5879 1030.9455 1046.0676 1077.3627 1096.3585 1125.8572 1171.4002 1177.3957 1186.2426 1241.7657 1266.8007 1309.7221 1333.3455 1373.1932 1398.8189 1428.7415 1457.0318 1463.8487 1480.6341 1523.8409 1588.4652 1598.3215 1612.7696 1649.2280 2983.1362 3063.7414 3101.6395 3121.5950 3129.3444 3132.3271 3141.3052 3150.5836 3164.2652 3553.3172
redmass: 4.2510 4.9140 5.6838 7.2625 1.1732 5.9276 1.3900 2.0649 7.0548 4.4078 3.3456 6.6475 11.7524 2.8143 6.2937 6.4735 3.9877 4.8107 7.0238 6.6217 5.7173 6.2914 5.3938 5.8330 1.7344 4.5230 2.0570 4.1505 1.2484 1.4917 1.4807 3.0336 1.3903 4.0929 1.4756 2.0263 2.0251 1.4401 1.5916 4.4324 6.1905 1.0517 1.6653 1.1216 2.5193 1.3956 1.3421 6.5690 7.7460 1.2161 2.2022 1.0429 1.0769 2.4107 9.3662 6.1630 7.2986 6.3980 7.6618 1.0367 1.0981 1.0990 1.0842 1.0877 1.0903 1.0926 1.0970 1.1018 1.0667
irintensity: 0.0209 10.9605 3.3210 3.2425 0.1559 0.8288 85.6445 29.3771 1.1758 0.7634 4.1698 1.2052 3.3210 0.0287 0.0585 6.9837 19.6260 1.3468 26.0373 10.0158 1.3608 0.5933 1.1619 18.8064 48.5531 0.2677 58.9114 19.7545 0.1411 21.2587 2.1315 26.7287 0.0167 2.1386 0.3276 2.5981 6.6717 6.5099 9.7268 142.2262 60.4859 0.0148 107.6358 3.6624 79.0199 7.2688 0.2381 132.1871 0.0640 23.2497 6.9860 19.0845 4.5007 18.7141 196.2676 1.2796 24.8630 4.2069 141.9686 17.1599 11.7446 9.3397 0.9475 0.9575 4.6242 24.4010 43.4206 22.2953 57.9265
temp: 298.150 k
press: 1.00000 atm
elementType: 16 8 8 6 6 6 6 6 6 6 6 6 6 6 6 1 1 1 1 1 1 1 1 1 1
symmnumber: 1
zpe: 483543.6 jmol-1
zpe.correction: 0.184172 hartree
zpe.thermalcorrener: 0.197501 hartree
zpe.thermalcorrenthalpy: 0.198445 hartree
zpe.thermalcorrgfe: 0.143699 hartree
zpe.sumelectzpe: -1010.696238 hartree
zpe.sumelectthermal: -1010.682909 hartree
zpe.sumelectthermalent: -1010.681965 hartree
zpe.sumelectthermalfe: -1010.736711 hartree
dipole: 4.1776 3.8403 -0.0480
dipole: 5.6748
quadrupole: -73.0043 -98.3248 -90.2113
quadrupole: -1.7202 0.0334 0.3191
quadrupole: 14.1758 -11.1447 -3.0312 -1.7202 0.0334 0.3191
hfenergy: -1010.8804104 hartree
pointgroup: C01 [X(C12H10O2S1)]
dipole: -1.5703675 1.5869149 -0.0164093 debye
dipolederiv: -0.6406596 -0.1745701 0.0008978 -0.0248962 -0.4362744 0.0042264 -0.0029211 0.0050751 0.0482995 -0.4070069 -0.6238152 0.0043265 -0.266439 -1.186574 0.0067175 0.0015015 0.0076562 -0.3309642 -0.6710278 0.2825168 -0.0018638 0.1911489 -1.0427275 0.0071023 -0.0038573 0.00714 -0.3095973 -0.012471 -0.0265593 -0.0004751 -0.1537139 -0.8840025 0.0078736 0.0014167 0.0081811 -0.1055038 0.3304632 -0.044055 0.0003429 0.0518435 -0.0292094 0.0000274 -0.0002801 0.0009163 0.0322666 0.8872082 -0.1822244 0.0018713 -0.0384402 1.26211 -0.0096132 0.0022364 -0.0117483 0.1463019 0.9330646 0.1687839 0.0009099 0.0347542 1.3639426 -0.0105381 0.0024168 -0.0122109 0.0113815 0.4878971 0.1307084 -0.00071 0.1368683 0.7422305 -0.0080498 0.0004679 -0.0089896 -0.127435 -0.667447 0.2601759 -0.0028221 0.0693619 -0.2307846 0.0010035 -0.0005412 0.0018021 -0.1149167 -0.1500651 0.0123721 -0.082952 0.0251613 -0.094297 -0.0157261 0.0274979 -0.0176954 0.0602062 -0.149857 0.0089181 0.0819623 0.0255191 -0.0967121 0.0075371 -0.0281836 0.0142926 0.060106 -0.0295529 -0.0073696 0.0900114 -0.0255583 -0.1424598 -0.0133099 0.0653845 -0.0043244 0.0731972 -0.0291375 -0.0032801 -0.0899412 -0.0245732 -0.1427519 0.006024 -0.0662975 -0.0025626 0.0729623 -0.1879274 -0.031791 -0.0000208 -0.0752595 -0.0313173 0.000949 0.0000844 0.001139 0.0813978 0.0916619 -0.0115955 -0.0000781 -0.0155121 -0.1673195 -0.0015885 -0.0004795 -0.0024986 -0.0536688 0.0172629 -0.0252692 0.0000791 -0.0980937 -0.0144405 0.0015853 -0.0000275 0.0018726 0.1586537 0.0499015 0.0001295 0.1011502 0.0111456 0.1228326 0.0029078 0.093331 -0.0023181 -0.044712 0.0496396 0.0036523 -0.1011457 0.0143044 0.1228291 0.0037422 -0.092351 0.0059588 -0.0458216 -0.003238 0.0114699 -0.0902083 0.0097855 0.151799 0.008993 -0.1109096 0.0102129 -0.0788825 -0.0037864 0.0089379 0.0906129 0.0056095 0.1522029 -0.0015636 0.1115202 -0.0032693 -0.0788892 0.0296989 0.0171029 -0.0366868 0.0495795 0.0646432 0.0945956 -0.0863271 0.0780649 -0.0214499 0.0294356 0.0181347 0.0365593 0.0516211 0.0610892 -0.0961267 0.0854928 -0.0797002 -0.0176038 0.0377673 -0.0162205 -0.000003 -0.1025125 -0.0805453 0.0019604 0.0009723 0.0021281 0.1266264 -0.15693 0.0160784 -0.000103 0.0185543 0.1576373 0.0011281 0.000004 0.0010123 0.086921 0.1651057 0.2077691 -0.0017136 0.1297414 0.3780994 0.0001428 -0.0001509 -0.0001345 0.371125 unknown
polarizability: 215.37769|-12.7468467|135.8305115|0.1627598|-1.2988313|105.0249592 unknown
InChI: InChI=1S/C12H10O2S/c1-8-7-10(13)11(12(14)15-8)9-5-3-2-4-6-9/h2-7,14H,1H3
charge 0 multiplicity 1
25 atoms
S  -2.705803 1.553147 -0.019787
O  -0.155277 2.471401 -0.026349
O  -0.359505 -2.328256 0.023577
C  -0.262375 0.075243 -0.002622
C  1.239252 0.026348 -0.001744
C  -0.992024 -1.217258 0.010958
C  -0.89744 1.293745 -0.015448
C  -3.327226 -0.162605 -0.002971
C  -2.474103 -1.226781 0.008905
C  1.951903 -0.028552 1.220865
C  1.955133 0.009241 -1.223582
C  3.363006 -0.093863 1.22171
C  3.366263 -0.056445 -1.222798
C  -4.834729 -0.237055 -0.004188
C  4.074397 -0.106499 -0.0001
H  -2.90586 -2.235776 0.01854
H  1.401187 -0.027234 2.168047
H  1.406893 0.040462 -2.171718
H  3.905382 -0.138437 2.172937
H  3.91116 -0.071798 -2.173516
H  -5.263448 0.245826 -0.90201
H  -5.265826 0.2640 0.882471
H  -5.157461 -1.291172 0.0061
H  5.169072 -0.159222 0.000544
H  -0.71717 3.287838 -0.033621
