program: Gaussian 09
title: 000209654
version: EM64L-G09RevD.01
frameworkgroup: C1[X(C14H12O4S)]
method: RPBEPBE
basis: SDD
operation: Freq
keyword: #p
keyword: freq=noraman
keyword: PBEPBE/SDD
title: #p freq=noraman PBEPBE/SDD
converged: YES YES NO NO
title: Mulliken charges:
elementType: S O O O O C C C C C C C C C C C C C C H H H H H H H H H H H H
charge: 0.220286 -0.388604 -0.243186 -0.383176 -0.223126 -0.671849 0.416029 0.465011 0.066375 0.322922 -0.320900 -0.287005 -0.406572 -0.383327 -0.736259 -0.227585 -0.230244 0.050998 -0.244409 0.260149 0.229926 0.235052 0.272502 0.254941 0.243638 0.275571 0.220281 0.223136 0.224703 0.379739 0.384983
chargesum: 0.00000
title: Mulliken charges with hydrogens summed into heavy atoms:
elementType: S O O O O C C C C C C C C C C C C C C
charge: 0.220286 -0.008865 -0.243186 0.001807 -0.223126 -0.181774 0.416029 0.465011 0.066375 0.322922 -0.320900 -0.287005 -0.171520 -0.110824 0.037890 -0.007304 -0.007108 0.050998 -0.019706
polarizability: 2.14892253e+02 4.81123826e+00 2.01787688e+02 -4.23488872e+00 -5.26250806e+00 1.19846491e+02
1716.lowfreq: -4.4167 -0.0003 0.0003 0.0019 0.5076 4.9204 12.3960 24.3157 40.0905
frequency: 11.6537 24.2747 40.0825 46.3167 73.6192 75.0581 90.6324 128.9559 151.3154 176.5827 177.5292 197.7955 219.2887 266.1698 296.9770 312.4380 345.5647 383.4616 391.5563 404.0539 410.8004 438.4033 468.9174 501.8045 525.1496 539.1102 552.4201 564.6291 607.0471 617.4022 631.6001 672.4394 705.7111 753.7720 757.6471 771.3485 796.1639 822.3357 857.8402 904.1126 924.6636 946.7739 980.3934 989.5109 996.5316 1016.8921 1026.9828 1042.7334 1066.4779 1083.1783 1096.2517 1106.5076 1165.2214 1171.1174 1188.1210 1190.1196 1205.7657 1236.1423 1298.1795 1303.3473 1329.5532 1343.2271 1382.3267 1400.7598 1441.3523 1452.9127 1455.2842 1473.0965 1481.0983 1510.5584 1592.0420 1595.6416 1611.4311 1639.4151 1646.3148 2990.0429 3020.9759 3070.7608 3085.3592 3117.5802 3117.9961 3125.8204 3138.0582 3146.8268 3161.0792 3506.8614 3564.1282
redmass: 4.4724 7.6490 5.2964 6.8072 1.1855 4.7218 3.8188 4.3353 5.6787 1.9848 2.8238 4.9377 5.2008 5.3677 5.8279 5.8272 4.4851 4.3860 3.1206 2.8563 5.3486 5.2801 5.8121 3.5739 4.3992 6.3511 5.3985 2.5978 5.2526 6.1870 2.7070 4.9859 1.7972 4.5852 2.2233 6.7191 3.7222 4.0615 1.2508 4.2623 1.6044 1.9666 1.3734 6.0702 1.3185 2.5700 2.2437 1.5118 3.0559 2.0316 2.0905 3.7857 1.1968 1.0629 1.3856 2.4107 2.7291 1.6138 2.5328 1.3936 1.3722 4.2900 7.4160 1.1967 2.1721 1.1429 1.0667 1.0579 2.2576 7.9871 6.2763 7.4431 6.0519 9.1470 8.2459 1.0379 1.0587 1.0977 1.1032 1.0844 1.0981 1.0876 1.0927 1.0964 1.1016 1.0639 1.0667
irintensity: 0.9554 3.2573 1.1336 2.0663 3.5677 4.2354 10.6361 6.1217 0.8917 79.1744 42.0430 0.2807 2.8487 2.6641 1.1987 1.6142 4.4753 2.5708 1.1092 0.2854 5.1935 1.3106 6.3937 6.7426 41.9317 15.1356 48.1322 44.4767 46.2214 1.9078 74.4153 7.9908 57.3880 0.7004 35.2228 11.1199 18.3732 1.7987 1.3655 1.6979 11.8579 15.0718 1.1754 0.0695 0.9666 117.5399 15.7173 12.3492 20.6381 21.0770 108.3629 238.9202 98.3845 7.6835 4.3021 4.2730 2.4445 4.9850 13.4934 3.0953 18.6952 148.2589 0.8160 32.2509 9.8432 27.7550 12.5199 22.8558 32.9315 168.2505 1.2295 6.5447 11.0003 200.9881 241.8420 9.3451 16.6398 8.0321 2.0550 1.9818 1.8281 4.6522 23.9338 26.0498 26.1789 32.9820 67.0300
temp: 298.150 k
press: 1.00000 atm
elementType: 16 8 8 8 8 6 6 6 6 6 6 6 6 6 6 6 6 6 6 1 1 1 1 1 1 1 1 1 1 1 1
symmnumber: 1
zpe: 593033.1 jmol-1
zpe.correction: 0.225874 hartree
zpe.thermalcorrener: 0.244419 hartree
zpe.thermalcorrenthalpy: 0.245363 hartree
zpe.thermalcorrgfe: 0.176073 hartree
zpe.sumelectzpe: -1238.267817 hartree
zpe.sumelectthermal: -1238.249273 hartree
zpe.sumelectthermalent: -1238.248329 hartree
zpe.sumelectthermalfe: -1238.317618 hartree
dipole: -1.0255 4.3274 -3.5071
dipole: 5.6638
quadrupole: -116.1265 -99.0230 -120.0325
quadrupole: -1.3632 7.0092 4.6817
quadrupole: -4.3991 12.7043 -8.3052 -1.3632 7.0092 4.6817
hfenergy: -1238.4936918 hartree
pointgroup: C01 [X(C14H12O4S1)]
dipole: -0.4878052 1.3310534 -1.7191937 debye
polarizability: 214.3591489|4.8047847|196.0698175|-4.1270042|-22.6236619|126.0974645 unknown
InChI: InChI=1S/C14H12O4S/c1-8-11(13(16)17)12(15)10(14(18)19-8)7-9-5-3-2-4-6-9/h2-6,16,18H,7H2,1H3
charge 0 multiplicity 1
31 atoms
S  -1.950461 2.147253 -1.100542
O  0.489637 3.015119 -0.29031
O  -0.646933 -1.2398 1.593543
O  -2.34712 -2.745069 -0.331119
O  -4.089467 -1.789577 0.870606
C  1.280438 0.825435 1.326891
C  -0.062173 0.860902 0.598367
C  2.395442 0.223572 0.467369
C  -0.957527 -0.298534 0.782823
C  -2.244328 -0.385704 0.034599
C  -0.38943 1.940425 -0.182443
C  -2.797224 0.572544 -0.774059
C  3.351427 1.057891 -0.165626
C  2.48484 -1.181881 0.28628
C  -4.11147 0.479226 -1.513762
C  4.376978 0.502261 -0.964883
C  3.508491 -1.737419 -0.513342
C  -3.002995 -1.670356 0.263395
C  4.458121 -0.898151 -1.14249
H  1.131423 0.206535 2.229014
H  1.55692 1.84724 1.636273
H  3.287126 2.14419 -0.03115
H  1.749542 -1.829929 0.776887
H  -3.942204 0.289915 -2.590321
H  -4.688201 1.417158 -1.424054
H  -4.727902 -0.33566 -1.10452
H  5.112679 1.158969 -1.443884
H  3.568102 -2.824341 -0.642147
H  5.254005 -1.330591 -1.759697
H  0.197237 3.702461 -0.940653
H  -2.808072 -3.592984 -0.083647
