program: Gaussian 09
title: 000209653
version: EM64L-G09RevD.01
frameworkgroup: C1[X(C15H14O4S)]
method: RPBEPBE
basis: SDD
operation: Freq
keyword: #p
keyword: freq=noraman
keyword: PBEPBE/SDD
title: #p freq=noraman PBEPBE/SDD
converged: YES YES NO NO
title: Mulliken charges:
elementType: S O O O O C C C C C C C C C C C C C C C H H H H H H H H H H H H H H
charge: 0.210146 -0.235137 -0.379601 -0.222391 -0.229733 0.253468 0.312244 0.061818 0.367428 -0.293186 -0.328937 -0.358700 -0.356639 0.090745 -0.739535 -0.240314 -0.236989 -0.239121 -0.260266 -0.651595 0.258942 0.238667 0.275263 0.251321 0.243999 0.225422 0.223340 0.226306 0.230399 0.220980 0.377481 0.207369 0.242585 0.254219
chargesum: 0.00000
title: Mulliken charges with hydrogens summed into heavy atoms:
elementType: S O O O O C C C C C C C C C C C C C C C
charge: 0.210146 -0.235137 -0.002120 -0.222391 -0.229733 0.253468 0.312244 0.061818 0.367428 -0.293186 -0.328937 -0.099758 -0.117972 0.090745 0.031049 -0.014892 -0.013649 -0.012815 0.191113 0.052579
polarizability: 2.48915617e+02 2.20917609e+01 2.25596648e+02 -1.19947022e+01 1.33220260e+01 1.24684753e+02
1716.lowfreq: -4.6928 -0.0022 -0.0015 -0.0009 6.1603 8.5840 22.6136 40.4349 50.6553
frequency: 22.4919 40.3740 50.6473 52.8630 67.3862 70.2093 78.8383 93.7351 113.4409 148.3706 160.9501 184.6697 198.9450 220.9695 242.4174 247.4981 276.2763 300.2443 307.8036 367.1952 368.7607 387.5490 401.1938 403.5130 433.9498 474.3863 499.1636 522.7710 543.0837 573.4143 612.0209 620.3870 644.8015 686.5941 697.2005 741.5394 759.5092 787.4585 796.3486 811.2339 822.3684 844.3149 855.8665 920.7468 969.7062 987.9480 991.0366 991.6481 1015.8906 1032.7952 1040.5946 1047.1642 1084.6571 1097.2904 1101.5574 1124.1483 1156.0069 1160.9833 1172.8941 1196.3284 1211.2975 1252.6842 1272.9532 1317.1925 1328.5060 1350.0246 1376.7385 1397.0657 1400.9605 1431.8234 1454.4470 1457.6287 1461.4646 1470.8205 1481.7037 1483.3631 1507.1678 1579.0128 1589.4249 1610.6515 1618.3566 1635.8419 2988.5741 2997.2282 3028.6744 3067.9612 3093.7620 3098.8283 3116.8993 3124.0034 3124.5510 3136.4253 3151.5438 3163.9230 3181.6445 3541.3432
redmass: 5.9297 3.8144 3.7460 3.5625 4.6627 1.2299 3.5744 4.4879 5.1832 3.9731 4.1288 5.6657 1.4038 1.1767 6.5201 4.3839 5.2922 3.3796 3.7129 7.7464 6.9841 6.5256 5.8511 3.1128 3.9396 5.8586 4.2735 6.3914 8.2192 8.7785 6.8178 7.4215 6.5791 5.3132 1.7913 2.5000 3.8894 3.2517 4.2174 4.0991 1.7385 1.2531 3.3036 1.4650 1.3979 2.9493 3.4179 1.4838 4.1379 2.1985 1.6386 2.3293 1.6861 2.2593 3.6437 4.2677 1.7000 3.4157 1.0547 1.1258 1.8830 3.9891 1.1260 2.0071 2.5439 1.3120 7.5518 1.2221 1.2012 2.2892 1.0625 1.0545 1.0854 1.0566 1.0886 2.2226 9.7219 6.5333 6.8946 6.0928 10.0043 8.4628 1.0377 1.0371 1.0597 1.0979 1.0981 1.1030 1.0981 1.0847 1.1046 1.0892 1.0944 1.0985 1.0965 1.0665
irintensity: 1.7669 2.8018 2.7370 2.1478 0.2291 0.0853 1.2018 2.9893 2.2286 0.9775 1.9211 1.3071 2.4142 136.9002 4.4840 0.2718 1.0717 14.5366 4.1267 2.3872 4.5334 0.2615 1.2038 0.3519 6.2428 9.3452 10.0313 13.7319 6.9710 29.0372 4.1342 2.8397 4.5973 28.9165 51.3576 43.2851 7.8300 8.4393 20.2490 13.7966 2.1574 0.4532 33.7925 4.6349 0.1708 5.8613 5.5914 0.6867 58.8780 57.4184 10.1779 41.9198 15.7450 78.7356 194.5267 18.0301 5.2354 275.8439 0.4879 2.6105 52.1807 85.6431 4.5084 73.3073 79.7524 6.2748 0.5305 27.0841 30.0259 17.0819 12.1002 21.0869 8.3023 16.1950 43.9480 12.1895 172.9120 7.4579 10.4602 2.9207 184.3293 138.9013 11.9267 18.0524 38.2496 8.5817 31.9501 7.7284 2.4586 0.1111 26.8897 13.0756 38.0370 25.1147 4.8084 58.2424
temp: 298.150 k
press: 1.00000 atm
elementType: 16 8 8 8 8 6 6 6 6 6 6 6 6 6 6 6 6 6 6 6 1 1 1 1 1 1 1 1 1 1 1 1 1 1
symmnumber: 1
zpe: 664696.9 jmol-1
zpe.correction: 0.253170 hartree
zpe.thermalcorrener: 0.273359 hartree
zpe.thermalcorrenthalpy: 0.274304 hartree
zpe.thermalcorrgfe: 0.202504 hartree
zpe.sumelectzpe: -1277.482250 hartree
zpe.sumelectthermal: -1277.462060 hartree
zpe.sumelectthermalent: -1277.461116 hartree
zpe.sumelectthermalfe: -1277.532915 hartree
dipole: 0.4938 4.1403 1.6362
dipole: 4.4792
quadrupole: -111.6091 -103.7396 -125.5669
quadrupole: -1.5658 6.4239 -0.5870
quadrupole: 2.0294 9.8989 -11.9283 -1.5658 6.4239 -0.5870
hfenergy: -1277.7354193 hartree
pointgroup: C01 [X(C15H14O4S1)]
dipole: 0.261439 1.5453554 0.8056014 debye
polarizability: 245.8375818|25.6558606|221.5022854|-20.4506408|22.1282495|131.8571508 unknown
InChI: InChI=1S/C15H14O4S/c1-3-19-14(17)11-9(2)20-15(18)12(13(11)16)10-7-5-4-6-8-10/h4-8,18H,3H2,1-2H3
charge 0 multiplicity 1
34 atoms
S  0.504838 3.160456 0.612297
O  3.169504 -0.981027 0.764952
O  -2.120949 2.643783 0.918398
O  0.422162 -1.245523 -0.366859
O  3.559449 -0.124866 -1.37354
C  -0.864709 0.664962 0.347635
C  1.702541 0.722548 0.00525
C  0.406677 -0.016649 -0.014431
C  -2.118474 -0.1531 0.39181
C  1.894826 2.061153 0.209694
C  -0.91521 2.018434 0.609633
C  -2.444625 -1.02962 -0.677547
C  -2.995574 -0.078854 1.506715
C  2.896586 -0.153907 -0.310789
C  3.212001 2.799538 0.181436
C  -3.624781 -1.802574 -0.634577
C  -4.169997 -0.859765 1.55194
C  -4.491709 -1.723405 0.479504
C  4.178026 -2.068971 0.537412
C  3.506894 -3.274215 -0.1254
H  -1.770881 -1.112061 -1.533779
H  -2.754629 0.588138 2.340434
H  4.000923 2.161849 -0.245671
H  3.515094 3.104403 1.20053
H  3.144018 3.712805 -0.437136
H  -3.862596 -2.471441 -1.469185
H  -4.831549 -0.794549 2.423109
H  -5.404261 -2.329456 0.513561
H  4.998579 -1.664579 -0.08154
H  4.539517 -2.295463 1.552965
H  -2.077148 3.631612 0.843134
H  4.231778 -4.106345 -0.200465
H  2.639087 -3.611282 0.465221
H  3.15699 -3.021129 -1.139412
