program: Gaussian 09
title: 000209629
version: EM64L-G09RevD.01
frameworkgroup: C1[X(C11H11NO4)]
method: RPBEPBE
basis: SDD
operation: Freq
keyword: #p
keyword: freq=noraman
keyword: PBEPBE/SDD
title: #p freq=noraman PBEPBE/SDD
converged: YES YES NO NO
title: Mulliken charges:
elementType: O O O O N C C C C C C C C C C C H H H H H H H H H H H
charge: -0.251043 -0.243251 -0.408718 -0.237186 -0.179202 -0.447164 -0.340878 0.326924 0.124958 -0.492255 0.202720 -0.347824 -0.344997 -0.246921 -0.210124 0.193112 0.239195 0.244870 0.229872 0.274896 0.255785 0.308860 0.232587 0.265831 0.233024 0.236681 0.380248
chargesum: 0.00000
title: Mulliken charges with hydrogens summed into heavy atoms:
elementType: O O O O N C C C C C C C C C C C
charge: -0.251043 -0.243251 -0.028470 -0.237186 -0.179202 0.036900 0.163890 0.326924 0.124958 0.072390 0.202720 -0.115236 -0.079166 -0.013897 0.026557 0.193112
polarizability: 1.89802663e+02 7.08998540e+00 1.31303184e+02 -8.37546834e+00 5.77647067e+00 8.03726865e+01
1716.lowfreq: -28.8914 -10.7139 -6.0300 -0.0010 -0.0008 0.0001 7.8315 22.5426 31.0988
frequency: -27.0444 22.4548 31.0315 69.3391 75.0808 106.4546 172.6918 181.4088 250.4547 265.5624 289.4490 336.2957 422.0280 434.9758 450.6635 456.4546 505.8975 523.9615 561.9430 579.9582 597.1667 640.6703 675.6254 690.7722 707.9509 717.3301 762.2632 778.0641 812.2933 863.0477 876.6167 884.2768 942.9142 983.6435 995.0749 1008.7709 1025.8963 1030.3383 1058.2304 1087.5947 1103.7679 1149.7144 1168.4103 1178.0987 1210.1726 1221.6304 1232.8117 1247.1351 1250.3090 1281.5741 1324.0127 1335.0460 1383.9198 1390.4660 1419.2284 1441.6502 1446.8176 1457.4442 1478.8636 1493.4302 1602.0024 1624.7780 1661.3786 1672.8703 2925.0522 2984.0595 3001.8388 3032.7854 3063.4671 3101.7829 3123.0677 3144.1651 3163.2157 3178.2175 3511.2198
redmass: 3.4685 11.6134 5.7316 4.2610 2.6121 6.4789 6.4979 3.8009 4.5612 4.0305 5.6247 4.0716 7.0192 3.1571 4.2609 7.1162 1.8114 3.6337 5.5240 5.2768 7.0427 1.3353 8.7941 7.3330 3.3765 4.9007 1.2963 1.4804 4.5575 1.3700 5.6203 4.4406 1.3768 1.3178 3.6191 1.8680 2.8264 2.2309 2.8028 2.4952 2.0728 1.8007 1.1604 2.1940 2.1261 1.1215 2.2243 1.5060 1.7579 1.4976 1.7794 1.5835 1.7274 5.3017 1.8627 1.1078 2.3443 1.1128 1.7255 1.4982 6.9474 7.3670 8.1824 9.7137 1.0657 1.0949 1.0633 1.0605 1.0968 1.1054 1.0888 1.0888 1.0948 1.0992 1.0640
irintensity: 0.9256 1.9266 1.3734 0.7634 0.5160 3.1276 2.4813 3.1490 1.2141 0.6228 2.8129 8.1168 3.0210 10.2589 22.8505 35.4291 29.9196 0.5766 2.2580 30.0903 1.8742 125.6658 23.0900 4.9695 5.4478 3.8581 92.4353 15.4031 24.1874 1.5711 7.4373 13.5352 2.7134 0.1160 69.2676 31.4745 128.7725 23.5896 135.3114 162.2269 15.7911 24.3778 45.1450 234.9807 92.6958 4.0606 39.0106 1.8708 6.5205 16.2878 19.6131 56.3817 94.4571 2.9572 51.3868 13.5190 63.4753 64.5915 79.0330 6.4451 27.0948 27.9437 218.9563 376.8138 43.6163 21.0788 8.6223 16.0033 2.0189 7.4796 6.5705 9.1501 18.4207 9.0952 23.2282
temp: 298.150 k
press: 1.00000 atm
elementType: 8 8 8 8 7 6 6 6 6 6 6 6 6 6 6 6 1 1 1 1 1 1 1 1 1 1 1
symmnumber: 1
zpe: 537596.1 jmol-1
zpe.correction: 0.204760 hartree
zpe.thermalcorrener: 0.218199 hartree
zpe.thermalcorrenthalpy: 0.219143 hartree
zpe.thermalcorrgfe: 0.162389 hartree
zpe.sumelectzpe: -780.269757 hartree
zpe.sumelectthermal: -780.256317 hartree
zpe.sumelectthermalent: -780.255373 hartree
zpe.sumelectthermalfe: -780.312128 hartree
dipole: -1.4861 -4.7706 1.1978
dipole: 5.1383
quadrupole: -77.2274 -98.4716 -97.3497
quadrupole: 0.8714 5.5611 -0.8086
quadrupole: 13.7889 -7.4554 -6.3335 0.8714 5.5611 -0.8086
hfenergy: -780.4745165 hartree
pointgroup: C01 [X(C11H11N1O4)]
dipole: 0.5909508 1.9092712 0.3036389 debye
polarizability: 189.9989417|7.5703214|129.9475487|6.3790128|-10.0864571|81.5320428 unknown
InChI: InChI=1S/C11H11NO4/c13-10(14)5-6-12-7-8-3-1-2-4-9(8)16-11(12)15/h1-4,13H,5-7H2
charge 0 multiplicity 1
27 atoms
O  1.236834 -1.603608 0.202746
O  -0.902907 -2.38447 -0.093438
O  -5.081857 0.391683 1.352807
O  -4.706175 0.907682 -0.88015
N  -0.53084 -0.106444 -0.423476
C  0.307737 1.110788 -0.330094
C  -1.963295 0.091949 -0.741093
C  1.773157 0.78669 -0.127819
C  2.17299 -0.540452 0.130122
C  -2.842903 0.091413 0.528778
C  -0.137756 -1.394712 -0.111206
C  2.767919 1.790546 -0.174432
C  3.523934 -0.883729 0.342376
C  4.12625 1.471137 0.037364
C  4.502284 0.130341 0.29681
C  -4.266588 0.50322 0.219686
H  -0.059814 1.750555 0.502434
H  0.175126 1.694938 -1.262938
H  -2.068803 1.048507 -1.281266
H  -2.293835 -0.714542 -1.415891
H  -2.444963 0.784589 1.295254
H  -2.847122 -0.914159 0.985906
H  2.47487 2.828043 -0.37731
H  3.780567 -1.9289 0.537402
H  4.885988 2.258269 -0.000888
H  5.554352 -0.124786 0.460939
H  -6.009648 0.669551 1.120179
