program: Gaussian 09
title: 000209634
version: EM64L-G09RevD.01
frameworkgroup: C1[X(C19H23NO)]
method: RPBEPBE
basis: SDD
operation: Freq
keyword: #p
keyword: freq=noraman
keyword: PBEPBE/SDD
title: #p freq=noraman PBEPBE/SDD
converged: NO YES NO NO
title: Mulliken charges:
elementType: O N C C C C C C C C C C C C C C C C C C C H H H H H H H H H H H H H H H H H H H H H H H
charge: -0.449065 -0.069976 -0.162149 -0.122393 -0.406142 -0.471943 -0.417715 -0.404370 0.468166 0.460739 -0.660384 -0.393336 -0.423915 -0.446344 -0.371690 -0.239629 -0.235926 -0.235014 -0.259785 -0.246267 -0.247403 0.227162 0.259881 0.244375 0.197785 0.239816 0.215738 0.209623 0.199423 0.210718 0.227921 0.164670 0.266240 0.328112 0.250780 0.235574 0.262469 0.256072 0.221468 0.221321 0.224640 0.220596 0.225729 0.224427
chargesum: 0.00000
title: Mulliken charges with hydrogens summed into heavy atoms:
elementType: O N C C C C C C C C C C C C C C C C C C C
charge: -0.120953 -0.069976 0.065013 0.137488 -0.161768 -0.034342 0.007646 0.005772 0.468166 0.460739 -0.001553 -0.142556 -0.188342 -0.183875 -0.115618 -0.018160 -0.014605 -0.010373 -0.039190 -0.020538 -0.022976
polarizability: 2.06608706e+02 -5.44218967e+00 2.31619349e+02 -2.35033969e+00 1.02320970e+01 1.77157809e+02
1716.lowfreq: -10.2818 -0.0006 -0.0002 0.0007 8.9886 18.0134 35.1803 43.0497 53.2376
frequency: 35.0387 42.9902 53.2013 61.2185 74.1812 85.2068 134.3326 139.4212 203.3262 208.5571 218.3807 225.7999 236.6426 253.4328 269.8835 289.8811 293.0587 329.3734 384.7844 403.3028 405.4055 441.7940 465.1805 477.1518 498.4601 533.3611 581.0739 601.6918 616.9603 623.0922 629.9066 689.5773 701.0776 707.8849 743.7722 756.2801 782.9356 800.4783 838.2237 843.5204 848.1152 853.1466 858.3059 867.1360 914.9576 920.0320 935.2623 965.7141 970.9501 979.5626 987.8207 990.5572 991.3997 991.9435 995.4473 1026.2977 1027.1635 1029.6707 1061.8715 1073.1595 1079.6919 1098.5719 1099.2807 1109.3094 1119.6300 1157.0499 1170.4924 1170.6281 1180.5013 1188.9215 1191.3149 1193.6431 1209.5833 1216.6453 1234.0273 1260.5890 1272.7607 1286.8787 1312.4289 1317.1615 1326.9208 1334.5320 1341.6695 1344.4311 1352.9195 1364.5192 1375.5595 1379.8670 1385.4581 1437.9904 1439.6381 1444.0060 1453.0359 1458.1487 1462.9671 1474.3254 1481.2502 1484.4324 1490.0529 1589.8501 1592.3292 1608.2651 1613.0816 2816.6463 2922.1088 2953.3327 2966.9427 2976.5526 2999.3072 3010.6944 3033.4109 3039.2369 3048.3814 3057.4416 3093.2913 3112.3870 3117.5742 3122.5461 3122.9622 3134.5670 3136.7421 3143.4799 3153.5387 3160.2070 3165.8296 3558.2560
redmass: 3.9446 3.8460 3.9078 4.7748 4.2977 4.1176 2.7722 3.7756 3.0364 2.2954 3.1557 2.2513 3.3807 3.3938 2.4328 3.5099 1.2647 2.7310 2.7945 2.7821 2.8440 1.9765 3.4728 3.5640 3.7624 2.9498 2.9747 5.6137 6.1842 5.4579 4.3065 2.9629 1.6605 1.7553 2.9998 1.9701 2.5771 3.1505 2.5269 1.9225 1.4050 2.5200 1.2643 2.9637 1.8214 1.5803 1.6887 2.7570 1.4162 1.5138 2.0051 1.3754 4.0266 4.0475 1.4792 2.0339 2.3562 2.1022 2.2800 1.7796 1.6410 1.5329 2.0175 1.9771 1.4454 1.3441 1.0690 1.0614 1.9739 1.4972 1.2646 1.4263 1.5363 1.8918 1.4206 1.6667 1.6907 1.5419 1.5160 1.3280 1.3940 1.3003 1.3016 1.3176 1.4584 1.3892 1.2258 6.2570 5.7572 2.1972 1.4718 1.4469 1.1044 1.0871 1.0777 1.0879 2.1851 2.2075 1.0631 6.0676 5.9181 5.9916 6.0602 1.0610 1.0817 1.0661 1.0635 1.0630 1.0825 1.0715 1.0949 1.0995 1.1007 1.0866 1.0949 1.0866 1.0844 1.0868 1.0872 1.0919 1.0928 1.0962 1.0961 1.1015 1.0985 1.0659
irintensity: 0.1121 0.3406 0.1189 0.2162 0.4946 1.7847 3.7292 1.0977 0.3761 1.0483 3.1604 15.9398 0.5812 2.6189 26.9415 11.4933 97.7233 0.7741 2.8377 0.0859 0.1980 5.4086 0.7361 4.3244 22.8042 23.5259 2.6913 9.0969 2.1398 1.5347 10.9881 6.4523 54.9460 57.9173 21.3688 41.0941 15.6136 33.6035 1.3789 3.1175 0.3113 8.8268 0.1430 22.6465 13.8887 1.5041 4.5439 29.2981 0.3018 0.0731 3.7463 0.0855 0.5468 0.0751 0.7417 24.8771 10.6849 18.0300 1.2704 26.2897 1.5042 3.4422 25.2083 14.3684 14.5147 15.9082 0.4305 0.3278 26.0690 2.6414 0.7251 2.4365 11.9561 0.3260 10.6743 0.9752 3.3528 1.5755 5.6938 7.6624 6.4855 5.8462 5.3080 1.5849 4.7255 1.2712 17.9772 0.4030 0.3961 14.8606 6.3272 2.9187 12.6588 11.8520 9.9616 11.6851 26.3539 20.2161 9.2370 2.8493 0.2748 15.0660 3.0590 157.9358 23.6393 41.5841 40.2360 27.7092 9.9811 46.9236 72.6145 44.2513 42.6441 28.3611 21.5968 6.9544 2.6029 0.3862 0.9361 13.9225 29.3756 34.2604 45.5554 31.0844 10.9265 0.9908
temp: 298.150 k
press: 1.00000 atm
elementType: 8 7 6 6 6 6 6 6 6 6 6 6 6 6 6 6 6 6 6 6 6 1 1 1 1 1 1 1 1 1 1 1 1 1 1 1 1 1 1 1 1 1 1 1
symmnumber: 1
zpe: 980448.3 jmol-1
zpe.correction: 0.373433 hartree
zpe.thermalcorrener: 0.392453 hartree
zpe.thermalcorrenthalpy: 0.393397 hartree
zpe.thermalcorrgfe: 0.326027 hartree
zpe.sumelectzpe: -866.224390 hartree
zpe.sumelectthermal: -866.205370 hartree
zpe.sumelectthermalent: -866.204426 hartree
zpe.sumelectthermalfe: -866.271796 hartree
dipole: -1.8268 -0.9422 -0.8787
dipole: 2.2354
quadrupole: -118.9067 -123.5117 -120.0458
quadrupole: 3.6310 1.3714 -1.6604
quadrupole: 1.9147 -2.6903 0.7756 3.6310 1.3714 -1.6604
hfenergy: -866.5978226 hartree
pointgroup: C01 [X(C19H23N1O1)]
dipole: -0.7706619 -0.2497827 -0.3423093 debye
polarizability: 205.5040503|-0.8663504|233.3178912|-0.347157|8.7615716|176.5639228 unknown
InChI: InChI=1S/C19H23NO/c1-20-14-8-13-17(21)19(20)18(15-9-4-2-5-10-15)16-11-6-3-7-12-16/h2-7,9-12,17-19,21H,8,13-14H2,1H3
charge 0 multiplicity 1
44 atoms
O  -2.207403 1.601426 1.512747
N  -2.100326 -1.088274 -0.121946
C  -1.246005 0.121078 -0.284416
C  -2.006416 1.445761 0.050893
C  0.109132 0.033454 0.484512
C  -3.342293 1.529646 -0.724478
C  -3.332377 -0.994964 -0.940073
C  -4.196779 0.244589 -0.582797
C  0.9984 1.23553 0.108092
C  0.872295 -1.284686 0.296925
C  -2.299067 -1.661527 1.217941
C  1.74895 1.247764 -1.09595
C  1.814685 -1.66571 1.287469
C  1.062427 2.368294 0.958848
C  0.724077 -2.113459 -0.843563
C  2.539156 2.366031 -1.442582
C  2.592698 -2.83538 1.145854
C  1.856408 3.486651 0.617328
C  1.501646 -3.284872 -0.991432
C  2.597637 3.49089 -0.586515
C  2.440166 -3.651193 0.000448
H  -1.014847 0.18204 -1.372968
H  -1.374726 2.311167 -0.209334
H  -0.127776 0.145534 1.560957
H  -3.107956 1.685657 -1.797638
H  -3.899192 2.421033 -0.381112
H  -3.909664 -1.930176 -0.816421
H  -3.035132 -0.926685 -2.007802
H  -4.586957 0.143588 0.451461
H  -5.08287 0.30205 -1.243319
H  -2.724744 -2.676895 1.10964
H  -2.987141 -1.094589 1.89853
H  -1.33165 -1.766874 1.734762
H  -2.893477 0.951445 1.808964
H  1.734526 0.369268 -1.751767
H  1.946728 -1.029761 2.172368
H  0.467814 2.377053 1.880393
H  -0.026694 -1.863425 -1.598699
H  3.116072 2.357076 -2.374722
H  3.315037 -3.108955 1.923603
H  1.893587 4.35279 1.288001
H  1.369839 -3.915527 -1.878437
H  3.215247 4.356185 -0.852908
H  3.040969 -4.56055 -0.11496
