program: Gaussian 09
title: 000209646
version: EM64L-G09RevD.01
frameworkgroup: C1[X(C20H25NO)]
method: RPBEPBE
basis: SDD
operation: Freq
keyword: #p
keyword: freq=noraman
keyword: PBEPBE/SDD
title: #p freq=noraman PBEPBE/SDD
converged: NO YES NO NO
title: Mulliken charges:
elementType: O N C C C C C C C C C C C C C C C C C C C C H H H H H H H H H H H H H H H H H H H H H H H H H
charge: -0.448034 -0.080846 -0.168982 -0.124302 -0.412243 -0.463144 -0.415443 -0.408531 -0.349180 0.470239 0.479959 -0.687110 -0.392824 -0.426981 -0.449277 -0.379911 -0.240510 -0.235231 -0.233915 -0.263442 -0.245863 -0.247267 0.223455 0.260431 0.236302 0.196111 0.238526 0.211495 0.209749 0.196842 0.210238 0.249250 0.154270 0.335199 0.203893 0.250249 0.206498 0.250973 0.234362 0.259800 0.254175 0.221700 0.221279 0.224905 0.222221 0.226100 0.224818
chargesum: 0.00000
title: Mulliken charges with hydrogens summed into heavy atoms:
elementType: O N C C C C C C C C C C C C C C C C C C C C
charge: -0.112835 -0.080846 0.054473 0.136129 -0.175941 -0.028507 0.005800 -0.001451 0.054340 0.470239 0.479959 -0.026470 -0.141852 -0.192619 -0.189477 -0.125736 -0.018810 -0.013952 -0.009011 -0.041221 -0.019763 -0.022448
polarizability: 2.23409616e+02 1.53274094e+01 2.38354795e+02 -3.17825146e+00 -8.15100206e+00 1.87012212e+02
1716.lowfreq: -6.3699 -0.0009 -0.0008 -0.0003 3.3974 7.4240 34.2541 40.1741 49.5240
frequency: 34.2171 40.1507 49.4090 60.9977 67.4557 76.7956 85.6866 111.5612 139.7763 188.5944 204.8761 208.4322 224.9003 241.4820 247.6019 268.8074 285.8815 288.2348 297.6871 330.2305 402.2149 403.8711 405.9118 448.0388 465.5137 477.6786 501.6631 539.2820 580.1191 603.1245 616.9473 623.1928 630.0937 688.1731 702.2376 707.5427 735.2507 755.2862 774.7154 792.8998 796.7546 836.3096 841.7823 848.8123 854.4595 858.4218 863.9896 913.8108 921.4156 934.4081 941.0308 967.5291 971.2708 979.8310 990.5424 991.3144 991.9286 994.8725 1012.6066 1026.9344 1028.5714 1042.6756 1060.4087 1072.8720 1079.1196 1086.7446 1095.1017 1101.2886 1115.0040 1157.2060 1170.0588 1170.6086 1171.5909 1188.1986 1188.9202 1193.1832 1208.9269 1214.3602 1228.3403 1251.9885 1269.3869 1279.8015 1298.6294 1313.8016 1321.3467 1328.9410 1332.1353 1340.7690 1346.6040 1352.8229 1357.6246 1367.4644 1376.1999 1380.1270 1385.3113 1387.4279 1438.4108 1444.1307 1449.2724 1456.0777 1463.7207 1471.1915 1474.1509 1480.9976 1484.4285 1485.1672 1590.2571 1592.4412 1608.5473 1613.1145 2811.7405 2927.1746 2953.5458 2966.8390 2974.8254 2980.6767 3001.1658 3031.3800 3044.8599 3050.6481 3059.1217 3059.4428 3079.0428 3096.8607 3111.5420 3118.2202 3121.5933 3122.7228 3134.9193 3135.6778 3144.1976 3150.7505 3160.9891 3162.7236 3554.6883
redmass: 4.1810 3.9759 3.6431 4.6063 3.6486 3.6188 3.2488 2.9902 3.3163 2.2194 5.2752 2.3665 3.7683 2.1993 3.7605 2.2235 2.8644 3.2651 1.2892 2.4776 2.3949 2.2506 2.8278 3.0164 3.3506 3.5195 3.4790 3.0463 3.0704 5.5780 6.1870 5.4047 4.2496 3.0958 1.6644 1.7514 2.8375 1.9612 2.0387 3.4767 1.2509 2.9153 1.8719 1.3027 2.4934 1.2582 3.1304 1.8949 1.5870 1.7084 1.9617 2.7933 1.4117 1.5106 1.3588 4.7582 4.0071 1.3960 2.0552 2.3643 2.1992 2.2893 2.3632 1.8420 1.6393 2.1598 2.0268 1.9099 1.6460 1.4387 1.3883 1.0838 1.3095 2.0321 1.3033 1.1505 2.1145 1.4333 1.5133 1.4449 1.5667 1.4116 1.3892 1.4178 1.3222 1.3049 1.3115 1.3282 1.3357 1.4408 1.3230 1.3608 1.2169 6.1596 1.2253 4.7844 2.1966 2.0626 1.0875 1.0824 1.0813 1.0519 1.0736 2.2145 2.2126 1.0790 6.0838 5.8739 6.0092 6.0411 1.0714 1.0815 1.0685 1.0633 1.0631 1.0362 1.0826 1.0958 1.0982 1.0984 1.0886 1.0894 1.0924 1.1001 1.0867 1.0847 1.0864 1.0875 1.0918 1.0924 1.0961 1.0952 1.1015 1.1001 1.0658
irintensity: 0.0524 0.1924 0.0674 0.2984 0.0560 1.2907 0.5525 2.8531 3.5001 0.5269 1.3452 2.0790 0.6965 1.2343 1.5479 29.3447 6.3856 6.0555 108.2865 0.2297 0.3918 0.0617 0.2044 16.2324 0.6024 4.6417 11.4460 26.6493 2.4845 9.4144 1.8693 2.2607 11.2482 8.3598 54.8320 56.7088 12.6933 40.8401 35.8416 22.7165 3.6797 1.9469 5.0830 0.3076 18.0435 0.0775 8.6912 14.5568 1.2940 3.8168 6.9966 21.2216 0.3342 0.0691 0.0791 0.4724 0.2371 0.4905 10.6948 5.4317 12.7592 18.2546 1.8572 27.8673 2.8881 11.9185 26.9528 14.6004 13.8644 7.8065 22.9546 2.0439 19.6876 0.7057 1.2694 1.4687 1.4800 18.4652 21.3089 1.5629 6.4301 0.9373 6.4126 0.8765 4.4968 13.4764 1.2467 2.3306 0.9872 5.1584 5.3910 8.7954 18.7091 0.1193 20.9552 1.1274 11.7196 5.1892 6.3293 14.2958 5.8486 8.8356 10.6464 25.4706 18.0513 7.9272 2.8209 0.2911 14.9980 2.9190 133.4070 24.6297 34.5529 40.8524 30.4610 33.8766 10.4210 71.0134 35.8188 51.4591 12.6707 19.4511 41.8955 36.5808 6.9896 3.1249 0.2787 0.4877 13.9757 26.5045 34.3534 42.9271 32.4998 13.5064 1.7311
temp: 298.150 k
press: 1.00000 atm
elementType: 8 7 6 6 6 6 6 6 6 6 6 6 6 6 6 6 6 6 6 6 6 6 1 1 1 1 1 1 1 1 1 1 1 1 1 1 1 1 1 1 1 1 1 1 1 1 1
symmnumber: 1
zpe: 1053403.9 jmol-1
zpe.correction: 0.401220 hartree
zpe.thermalcorrener: 0.421702 hartree
zpe.thermalcorrenthalpy: 0.422647 hartree
zpe.thermalcorrgfe: 0.351814 hartree
zpe.sumelectzpe: -905.449454 hartree
zpe.sumelectthermal: -905.428972 hartree
zpe.sumelectthermalent: -905.428028 hartree
zpe.sumelectthermalfe: -905.498860 hartree
dipole: 1.7120 -0.2523 -1.0138
dipole: 2.0056
quadrupole: -125.1873 -131.6247 -126.5222
quadrupole: -0.9034 -0.2508 2.8540
quadrupole: 2.5908 -3.8466 1.2558 -0.9034 -0.2508 2.8540
hfenergy: -905.8506747 hartree
pointgroup: C01 [X(C20H25N1O1)]
dipole: -0.6645977 0.1421577 -0.4009114 debye
polarizability: 226.499399|16.6920622|235.9913333|2.7351304|5.1400136|186.2858906 unknown
InChI: InChI=1S/C20H25NO/c1-2-21-15-9-14-18(22)20(21)19(16-10-5-3-6-11-16)17-12-7-4-8-13-17/h3-8,10-13,18-20,22H,2,9,14-15H2,1H3
charge 0 multiplicity 1
47 atoms
O  -0.957262 2.582453 1.467049
N  -2.176589 0.319983 -0.282417
C  -0.791602 0.868802 -0.358348
C  -0.736551 2.386423 0.014241
C  0.259567 0.049017 0.456256
C  -1.742986 3.196573 -0.834388
C  -3.102628 1.079088 -1.157956
C  -3.166046 2.588752 -0.799204
C  -2.741176 -0.086719 1.024545
C  1.678723 0.563283 0.142197
C  0.176555 -1.470744 0.265657
C  -3.716083 -1.276882 0.895794
C  2.361874 0.172245 -1.038096
C  0.663762 -2.311243 1.299768
C  2.322997 1.458173 1.034002
C  -0.309295 -2.078104 -0.919906
C  3.653582 0.667973 -1.32214
C  0.671137 -3.716502 1.159112
C  3.617499 1.952147 0.755378
C  -0.301594 -3.483885 -1.067756
C  4.288176 1.559903 -0.425812
C  0.188984 -4.310148 -0.030559
H  -0.504927 0.811031 -1.433686
H  0.282099 2.777094 -0.143797
H  0.08128 0.273998 1.525964
H  -1.380484 3.205047 -1.883101
H  -1.747542 4.245038 -0.483232
H  -4.105699 0.620202 -1.103868
H  -2.754685 0.974707 -2.207412
H  -3.619883 2.716634 0.205857
H  -3.827924 3.124434 -1.506399
H  -1.912448 -0.390717 1.684158
H  -3.274188 0.749728 1.551228
H  -1.897318 2.348047 1.674235
H  -4.585502 -1.033408 0.25769
H  -3.191568 -2.138809 0.44956
H  -4.101822 -1.569469 1.890633
H  1.891609 -0.542582 -1.723332
H  1.051198 -1.855922 2.220428
H  1.796308 1.778832 1.941126
H  -0.727408 -1.455289 -1.716587
H  4.169194 0.351941 -2.236456
H  1.052113 -4.345255 1.972111
H  4.099954 2.64178 1.457504
H  -0.68476 -3.934669 -1.990741
H  5.293024 1.939487 -0.643209
H  0.191733 -5.400068 -0.145694
