program: Gaussian 09
title: 000209622
version: EM64L-G09RevD.01
frameworkgroup: C1[X(C10H10N2O2S2)]
method: RPBEPBE
basis: SDD
operation: Freq
keyword: #p
keyword: freq=noraman
keyword: PBEPBE/SDD
title: #p freq=noraman PBEPBE/SDD
converged: YES YES NO NO
title: Mulliken charges:
elementType: S S O O N N C C C C C C C C C C H H H H H H H H H H
charge: 0.906882 0.494440 -0.533999 -0.499847 0.065568 -0.385043 -0.046255 -0.253190 -0.237533 -0.471172 0.450195 -0.330642 -0.392148 -0.797850 0.225852 -0.723157 0.290647 0.286234 0.245901 0.246695 0.230101 0.242382 0.236045 0.245765 0.252826 0.251300
chargesum: 0.00000
title: Mulliken charges with hydrogens summed into heavy atoms:
elementType: S S O O N N C C C C C C C C C C
charge: 0.906882 0.494440 -0.533999 -0.499847 0.065568 -0.385043 -0.046255 0.037457 0.048701 -0.471172 0.450195 -0.084741 -0.145452 -0.089321 0.225852 0.026734
polarizability: 2.11443333e+02 6.68963807e+00 1.52011507e+02 2.41075908e+00 1.80817714e+01 1.46772657e+02
1716.lowfreq: -7.5991 -3.4996 -0.0021 -0.0014 -0.0014 9.8892 27.4113 32.8313 35.3498
frequency: 27.3147 32.7744 35.3135 42.1799 96.1619 106.2405 116.4265 134.7029 163.5194 202.3031 223.3857 227.2553 257.9485 297.2636 306.1157 347.9230 385.5846 401.4294 407.2792 441.3302 509.5890 517.7121 521.8471 587.6629 607.2882 621.1596 649.8485 690.7375 708.7114 773.1931 795.1283 831.8109 850.9132 861.2025 908.5692 938.6578 964.5309 983.8656 987.7558 996.4147 1005.1953 1045.8388 1050.5524 1053.5046 1120.4417 1185.7406 1218.1448 1246.8395 1298.4254 1381.7469 1391.3052 1391.7796 1401.6268 1404.1716 1439.4737 1455.0225 1470.4301 1473.8124 1475.7317 1476.4158 1593.3467 1597.2972 2983.7881 3003.3512 3063.6846 3088.5596 3094.1640 3134.7518 3136.0127 3141.0866 3160.5437 3167.1389
redmass: 6.4467 4.8434 3.8910 1.0717 8.7501 3.2331 1.1696 7.0418 7.2989 6.9140 8.2927 6.0786 5.8963 5.5371 4.0770 3.9432 4.6043 9.2930 2.8890 7.4860 4.1361 7.6305 6.5800 6.2305 12.6410 6.9953 5.3102 7.6114 3.2690 5.8924 9.9249 1.3695 1.2541 9.4287 6.7424 14.6580 1.3121 1.3833 2.0374 2.5221 1.8198 1.5149 1.5890 2.4647 1.2863 1.1424 3.0236 5.1784 1.2601 4.6783 2.1366 1.9201 1.3090 2.8519 3.6308 1.0448 1.0499 2.2414 1.1149 1.5087 6.2082 6.6798 1.0378 1.0371 1.0971 1.0981 1.0992 1.0997 1.0890 1.0894 1.0960 1.0967
irintensity: 0.2055 0.5366 0.1171 0.3559 1.3872 1.9135 0.2783 0.8777 1.8575 3.1023 9.7476 1.6488 5.5281 10.0717 2.8652 6.2252 1.8897 15.1658 0.1636 86.2547 99.0983 11.2629 27.3970 41.2807 1.5024 0.1692 0.0418 7.8878 1.8126 19.4135 64.2943 37.7215 1.6079 17.3375 24.8050 50.0341 0.8287 0.4473 1.6942 4.6082 6.9897 5.5526 17.0405 30.1670 8.8628 11.9141 7.0167 30.5560 3.2802 2.9384 13.3576 2.4399 15.2062 50.8556 53.2481 17.9711 14.2436 27.5318 23.8156 27.2124 10.7009 2.9044 22.0344 5.0186 14.9313 7.9515 15.9118 3.7003 10.3376 9.2513 4.0400 6.9397
temp: 298.150 k
press: 1.00000 atm
elementType: 16 16 8 8 7 7 6 6 6 6 6 6 6 6 6 6 1 1 1 1 1 1 1 1 1 1
symmnumber: 1
zpe: 476765.5 jmol-1
zpe.correction: 0.181590 hartree
zpe.thermalcorrener: 0.198212 hartree
zpe.thermalcorrenthalpy: 0.199156 hartree
zpe.thermalcorrgfe: 0.134796 hartree
zpe.sumelectzpe: -1441.774665 hartree
zpe.sumelectthermal: -1441.758044 hartree
zpe.sumelectthermalent: -1441.757100 hartree
zpe.sumelectthermalfe: -1441.821459 hartree
dipole: 3.8147 5.5496 -1.6952
dipole: 6.9443
quadrupole: -91.6159 -113.6590 -111.4067
quadrupole: -0.0631 -6.0201 7.5490
quadrupole: 13.9446 -8.0984 -5.8462 -0.0631 -6.0201 7.5490
hfenergy: -1441.9562555 hartree
pointgroup: C01 [X(C10H10N2O2S2)]
dipole: -1.607698 -2.2021845 -0.1736124 debye
dipolederiv: 2.0902867 -0.0660534 -0.0883755 -0.171992 1.5156706 0.2442116 -0.0306815 0.1732559 1.0472022 0.0732981 0.1446408 0.0572097 0.1203108 -0.0593706 0.1902546 0.1366086 0.1354954 -0.0363367 -0.7404253 0.019657 0.0263556 0.020509 -0.6310609 -0.004172 0.0269132 0.1127921 -0.495257 -0.7152788 -0.0191499 -0.0157917 0.0227293 -0.5397325 -0.0686826 0.0381979 -0.2056313 -0.5919369 -0.4575971 0.3383216 -0.0240204 0.3246424 -0.7154228 0.366341 0.1178334 0.1945428 -0.4361317 -0.3670415 -0.1170374 0.1175322 0.1346601 -0.1261848 -0.2071773 -0.0385652 0.0028348 -0.2243681 -0.1374054 0.0212569 0.0100637 0.0669787 -0.253381 -0.0417174 0.0162367 -0.0312398 -0.1262938 -0.1377194 0.0431615 -0.0644004 -0.1007453 -0.0809559 -0.0703086 0.2545627 0.0674292 -0.0475517 -0.1230701 -0.0173037 0.1014745 0.0405671 -0.055989 0.0455203 -0.2241117 -0.0920165 -0.018561 -0.0022929 -0.075231 -0.2093204 -0.1097986 -0.0093452 -0.3253169 -0.391251 -0.2647643 0.3288415 0.4849156 0.2149423 0.0397246 0.2085324 0.086774 0.0114026 0.0669091 0.017617 0.0216075 -0.201084 -0.0521459 0.1369794 -0.0666523 -0.1640221 0.0029587 0.1281004 -0.0105518 0.0659785 -0.2464039 0.0039774 -0.1072282 -0.0142372 -0.0962044 -0.1112763 -0.1158249 -0.0953492 0.0307257 -0.2125595 -0.1043086 -0.0267497 -0.0383273 0.0335422 -0.0183932 -0.1106911 -0.0539955 0.068834 0.1951366 -0.201428 0.1081085 -0.3149454 0.5836589 -0.2289243 0.2030609 -0.251876 0.189757 0.028275 0.0200375 0.0048357 0.0958058 -0.1315952 0.0937979 -0.0689161 0.1772621 -0.051611 0.1470988 -0.0438945 0.049297 -0.0146139 0.1196269 0.0473799 0.037258 0.0226445 0.0788805 0.1211462 -0.0120403 -0.0667033 0.0057608 0.1317653 -0.0124758 -0.056317 0.0113667 0.0765586 0.0043304 -0.0364585 -0.0911405 -0.0515431 0.1269568 0.0073927 -0.0981 0.0134185 -0.024849 0.0255781 -0.0735953 0.0547776 -0.0925253 0.0872271 0.0840334 0.0485341 0.0710675 -0.0066011 0.0730784 -0.0170663 -0.0124239 -0.0681018 0.0416277 0.0726514 0.0808787 0.1241825 -0.0670236 -0.0810954 0.0481708 -0.0168932 0.0918481 -0.0076098 0.0238771 -0.0154333 0.0379417 0.1118188 0.0605084 -0.012608 0.0237709 -0.076194 0.0038857 -0.0881306 -0.0061788 -0.1227452 -0.0313126 -0.009677 -0.0955264 -0.006868 -0.0450166 0.0016673 0.0309892 -0.0146302 0.0312947 0.1175076 0.0237767 0.073311 0.0557158 0.0343861 0.0878167 -0.0009415 0.10211 -0.0544994 0.0570656 0.1042215 0.0163704 -0.0559299 -0.0020377 0.0506549 -0.0432939 -0.086503 -0.0104761 -0.0369434 unknown
polarizability: 210.9793988|2.2539495|145.366984|-8.233574|-17.9445394|153.881115 unknown
InChI: InChI=1S/C10H10N2O2S2/c1-7-3-5-9(6-4-7)16(13,14)10-11-8(2)12-15-10/h3-6H,1-2H3
charge 0 multiplicity 1
26 atoms
S  0.478575 1.559551 0.181825
S  2.816987 0.389254 -1.715398
O  0.596853 2.582204 -1.09098
O  0.703052 2.034083 1.721454
N  2.034671 -0.815169 0.512703
N  3.641878 -1.146246 -1.214381
C  -1.157448 0.628954 0.059579
C  -1.839938 0.66158 -1.166929
C  -1.647965 0.001476 1.213762
C  1.785456 0.230277 -0.237573
C  -3.625494 -0.669649 -0.103307
C  -3.083487 -0.001589 -1.2356
C  -2.895565 -0.655341 1.11462
C  -4.970557 -1.365825 -0.197163
C  3.083309 -1.573622 -0.058659
C  3.56824 -2.827462 0.605811
H  -1.421528 1.201139 -2.023136
H  -1.085659 0.03572 2.152284
H  -3.643014 0.004459 -2.178186
H  -3.306613 -1.159524 1.996235
H  -5.201564 -1.931566 0.720747
H  -5.784868 -0.633727 -0.354848
H  -4.999009 -2.070365 -1.048297
H  2.740929 -3.551752 0.706247
H  4.37881 -3.279654 0.015674
H  3.937948 -2.601704 1.621419
