program: Gaussian 09
title: 000209626
version: EM64L-G09RevD.01
frameworkgroup: C1[X(C17H16N2O3)]
method: RPBEPBE
basis: SDD
operation: Freq
keyword: #p
keyword: freq=noraman
keyword: PBEPBE/SDD
title: #p freq=noraman PBEPBE/SDD
converged: YES YES NO NO
title: Mulliken charges:
elementType: O O O N N C C C C C C C C C C C C C C C C C H H H H H H H H H H H H H H H H
charge: -0.246472 -0.290323 -0.261336 -0.188653 -0.613195 -0.177403 -0.638263 -0.458045 0.338413 0.502508 0.225311 0.208622 0.131124 -0.356456 -0.346675 -0.383355 -0.437617 -0.242478 -0.210741 -0.242533 -0.228669 -0.243927 0.283684 0.253859 0.258961 0.266082 0.268245 0.235851 0.264894 0.237038 0.237332 0.233078 0.236589 0.327541 0.370940 0.229013 0.226985 0.230071
chargesum: 0.00000
title: Mulliken charges with hydrogens summed into heavy atoms:
elementType: O O O N N C C C C C C C C C C C C C C C C C
charge: -0.246472 -0.290323 -0.261336 -0.188653 0.085286 0.106281 -0.125443 0.076282 0.338413 0.502508 0.225311 0.208622 0.131124 -0.120605 -0.081782 -0.146317 -0.200285 -0.009401 0.025848 -0.013519 -0.001684 -0.013856
polarizability: 1.85474562e+02 2.18582544e+01 2.10372279e+02 -1.61301609e+01 1.82586989e+01 1.84445364e+02
1716.lowfreq: -15.3492 -10.2096 -0.0008 -0.0007 -0.0006 4.7814 10.3899 20.5346 40.1708
frequency: 6.2993 20.2101 40.0270 52.7739 65.8190 79.5244 94.1074 145.0973 149.9009 185.0220 196.3896 229.8138 261.5766 293.9527 307.9905 323.0200 333.4704 397.1542 402.4152 428.6950 439.7896 467.2800 522.9016 525.9573 542.3109 579.9416 590.4079 612.4909 613.8420 626.7137 650.1674 677.9633 702.7933 706.2744 718.4119 725.6937 736.3629 752.6357 763.0168 804.1379 805.9050 852.9656 860.1621 874.8644 886.0859 907.0329 943.5875 953.1715 976.3655 984.3297 990.3003 994.4702 1000.8804 1010.1701 1027.7757 1030.5716 1074.5817 1090.9104 1100.3312 1120.0084 1149.0240 1168.2849 1172.8664 1173.3492 1190.3801 1206.3642 1211.0934 1232.9192 1238.7402 1242.8611 1273.0320 1284.4394 1305.6652 1334.0691 1355.2659 1365.3666 1381.5121 1389.2344 1417.7156 1440.0658 1445.9504 1467.4372 1475.3509 1486.6399 1492.0882 1587.0527 1591.8760 1601.9429 1615.2569 1623.8972 1642.9096 1647.1053 2947.7635 2985.7013 3037.8983 3042.5592 3056.4980 3113.7082 3123.0044 3128.6700 3134.9275 3144.9347 3146.0300 3163.8749 3164.0121 3178.4918 3417.4335 3618.5566
redmass: 4.9130 4.2091 5.7207 4.2779 8.1695 4.7176 5.7947 4.8939 5.5446 4.4681 3.6097 5.0087 5.5987 3.3257 5.7943 4.0281 4.9849 4.3259 2.8260 4.1616 4.0735 3.2109 3.6940 4.0304 5.1294 4.8956 2.5128 4.8179 5.1092 4.8390 2.2070 5.4672 2.2280 3.2456 1.6624 4.1116 1.4084 2.7165 1.3139 4.3186 3.7699 1.2497 1.6307 3.0218 3.7306 1.6133 1.4046 2.3379 1.4012 1.3189 6.0091 1.5866 2.5753 1.7875 2.2448 2.0874 1.7764 1.9842 2.2752 1.9439 3.5172 1.6638 1.4726 1.0810 1.1784 1.5488 2.0792 1.9305 1.7168 1.4885 1.3708 1.6153 1.7505 1.7604 1.5335 1.9964 5.7387 5.9285 1.9148 2.1378 2.3088 1.1293 1.5137 2.2609 1.6580 1.8929 5.3293 6.2785 5.9356 4.2322 3.8781 6.2671 1.0686 1.0658 1.0892 1.0915 1.0898 1.0875 1.0862 1.0882 1.0910 1.0893 1.0959 1.0953 1.1012 1.0993 1.0529 1.0985
irintensity: 0.0897 0.1017 1.5894 0.4566 8.3310 3.4087 2.3883 2.9077 12.0187 3.9498 4.0350 5.2011 1.6277 5.4656 4.0545 4.2617 9.3275 3.3226 0.1683 3.1394 6.7481 8.6394 2.0546 8.3773 17.3694 26.9261 33.6633 10.0643 6.3807 3.7483 104.7322 25.9496 51.6204 6.8610 99.1132 36.6155 148.7990 3.0258 84.8021 1.0726 2.5178 0.4289 3.4069 6.3709 22.1906 0.8583 4.2235 56.2090 0.2842 0.1274 0.8117 11.0485 17.1037 6.8816 6.0945 6.6252 11.1281 0.7699 17.5988 42.9572 19.5969 220.8208 160.4870 10.1248 2.4289 39.4519 12.4241 25.0167 47.3015 15.0375 9.3597 23.6949 16.4773 35.9962 20.9939 36.2861 0.2304 8.6959 51.7474 2.0001 60.9706 48.3346 51.9244 21.4267 7.0853 271.2683 31.8270 3.4359 4.8339 38.1536 48.2080 400.4440 18.7158 8.4858 0.4224 7.7680 14.1757 7.3140 3.4070 3.3987 11.4560 8.9461 37.2523 15.1798 22.3103 9.3986 79.4920 64.2976
temp: 298.150 k
press: 1.00000 atm
elementType: 8 8 8 7 7 6 6 6 6 6 6 6 6 6 6 6 6 6 6 6 6 6 1 1 1 1 1 1 1 1 1 1 1 1 1 1 1 1
symmnumber: 1
zpe: 782780.3 jmol-1
zpe.correction: 0.298145 hartree
zpe.thermalcorrener: 0.316889 hartree
zpe.thermalcorrenthalpy: 0.317833 hartree
zpe.thermalcorrgfe: 0.247757 hartree
zpe.sumelectzpe: -991.052526 hartree
zpe.sumelectthermal: -991.033782 hartree
zpe.sumelectthermalent: -991.032838 hartree
zpe.sumelectthermalfe: -991.102915 hartree
dipole: -1.1208 -2.6380 -1.0598
dipole: 3.0559
quadrupole: -123.4741 -119.0469 -133.0662
quadrupole: 2.2812 6.4160 5.1388
quadrupole: 1.7216 6.1488 -7.8704 2.2812 6.4160 5.1388
hfenergy: -991.3506713 hartree
pointgroup: C01 [X(C17H16N2O3)]
dipole: -0.4834594 0.9581525 0.5419468 debye
polarizability: 175.8774644|-26.9997529|205.8413773|8.9283974|15.2929813|198.5733634 unknown
InChI: InChI=1S/C17H16N2O3/c18-16(20)14(10-12-6-2-1-3-7-12)19-11-13-8-4-5-9-15(13)22-17(19)21/h1-9,14H,10-11,18H2
charge 0 multiplicity 1
38 atoms
O  -1.733507 -0.633958 -1.975784
O  0.127944 -1.821157 -2.577732
O  1.085595 -3.633719 1.491173
N  -0.02322 -1.088579 -0.362426
N  0.859708 -4.026763 -0.799118
C  1.304642 -1.718332 -0.076768
C  2.106249 -1.005982 1.028331
C  -0.856509 -0.655248 0.787506
C  -2.040351 0.173884 0.335112
C  2.294389 0.496922 0.848487
C  -0.489249 -1.220146 -1.656608
C  1.083447 -3.21869 0.293455
C  -2.430845 0.155679 -1.017922
C  -2.791756 0.962871 1.235396
C  -3.536642 0.885645 -1.493593
C  2.418114 1.09977 -0.430134
C  2.395756 1.325354 1.996498
C  -3.908981 1.700723 0.786567
C  -4.280615 1.660716 -0.5793
C  2.640482 2.489443 -0.555477
C  2.621568 2.714891 1.87569
C  2.744289 3.303161 0.595946
H  1.856916 -1.682583 -1.031365
H  3.09772 -1.502392 1.044603
H  1.663377 -1.235758 2.014037
H  -0.22278 -0.05317 1.461166
H  -1.192371 -1.548412 1.356446
H  -2.499902 0.997485 2.291809
H  -3.792932 0.835453 -2.555627
H  2.340166 0.490168 -1.337808
H  2.304807 0.874415 2.993125
H  -4.483996 2.305877 1.494713
H  -5.144407 2.233478 -0.932328
H  0.652665 -5.014296 -0.647176
H  0.77312 -3.611884 -1.735202
H  2.731046 2.936538 -1.551859
H  2.699688 3.335328 2.77566
H  2.916374 4.380667 0.497007
