program: Gaussian 09
title: 000209662
version: EM64L-G09RevD.01
frameworkgroup: C1[X(C17H23NO2)]
method: RPBEPBE
basis: SDD
operation: Freq
keyword: #p
keyword: freq=noraman
keyword: PBEPBE/SDD
title: #p freq=noraman PBEPBE/SDD
converged: YES YES NO NO
title: Mulliken charges:
elementType: O O N C C C C C C C C C C C C C C C C C H H H H H H H H H H H H H H H H H H H H H H H
charge: -0.306230 -0.240554 -0.098036 0.009896 0.255081 -0.559287 -0.436193 -0.523712 -0.411726 -0.361876 -0.423097 -0.393263 0.448998 -0.395929 -0.376931 0.299492 -0.244921 -0.248962 -0.239997 -0.767026 0.212297 0.219480 0.234269 0.195224 0.202994 0.210214 0.259969 0.190366 0.213143 0.209074 0.166623 0.192826 0.214127 0.204825 0.191628 0.243458 0.244889 0.223668 0.223415 0.227873 0.247000 0.242980 0.243929
chargesum: 0.00000
title: Mulliken charges with hydrogens summed into heavy atoms:
elementType: O O N C C C C C C C C C C C C C C C C C
charge: -0.306230 -0.240554 -0.098036 0.222193 0.255081 -0.105538 -0.037975 -0.053529 -0.008217 0.013821 -0.016144 0.003190 0.448998 -0.152470 -0.132042 0.299492 -0.021252 -0.025547 -0.012124 -0.033117
polarizability: 2.28555017e+02 1.57481014e+01 1.60953196e+02 -1.12221509e+00 -2.18723617e+00 1.74870704e+02
1716.lowfreq: -14.7134 -5.2168 -0.0005 -0.0002 -0.0002 7.6262 40.7086 42.9532 51.1971
frequency: 40.6643 42.3850 51.1739 60.7716 67.5475 76.6425 91.4669 145.8398 171.2215 190.8718 234.9702 236.1195 263.8907 282.2175 297.8574 313.3993 320.6263 348.4025 401.8158 405.6122 440.0746 454.7866 472.4849 481.7718 506.8988 527.2335 561.5391 569.6012 616.1693 626.8408 648.6489 703.7826 708.5416 712.2993 770.7304 806.4064 823.1285 840.6550 852.8940 866.6844 874.9537 893.0043 914.2899 928.3209 933.9909 960.5819 976.9679 990.4858 991.5438 995.1166 1004.3631 1014.0333 1030.8758 1037.5950 1038.9351 1065.5348 1081.0169 1091.2528 1093.2656 1118.4817 1128.2700 1134.3379 1165.1817 1173.3618 1174.1232 1192.6359 1202.3252 1205.7035 1222.8550 1235.1668 1243.0896 1264.4688 1273.3899 1288.1402 1293.7872 1321.1184 1329.2763 1334.4596 1336.1114 1341.8821 1347.5227 1354.7825 1358.6647 1378.2283 1380.3694 1396.6722 1430.3327 1436.8131 1447.4907 1452.3489 1454.6403 1455.5434 1457.3030 1458.7729 1468.8302 1477.7417 1484.8010 1591.9498 1613.8827 1643.7715 2815.5508 2834.4152 2856.2069 2966.5020 2973.6712 2984.6509 2996.3733 3003.0192 3005.5588 3015.7544 3024.0734 3031.0864 3037.5223 3051.4358 3061.3133 3089.8986 3095.2965 3121.1119 3129.6965 3138.1007 3142.4552 3156.5492 3169.0585
redmass: 3.6515 3.6559 1.4046 3.9876 2.9997 2.6073 4.1165 3.2043 3.0265 4.7786 4.6087 2.8354 3.3701 3.4338 2.4001 4.0338 1.7842 2.1836 2.9046 3.2576 3.1535 3.0938 3.4469 2.4880 2.8221 2.7982 2.4478 2.7998 6.1417 3.3398 4.3758 1.7951 3.4921 4.0583 1.9903 1.7263 1.7335 2.4742 1.2665 2.6444 1.7381 5.7185 1.8311 1.8832 2.9185 1.6440 1.3965 3.3966 2.1837 1.4199 2.2047 2.1306 2.0506 1.7066 1.7797 1.9034 1.8681 1.8788 1.8038 2.2894 2.6925 2.5041 2.0429 1.1022 1.4678 1.4435 2.0441 1.4798 2.3653 1.5365 1.7806 1.2131 1.2704 1.2851 1.5558 1.3444 1.3707 1.3804 1.3167 1.4607 1.4000 1.5813 1.7074 1.2539 6.3929 1.4550 1.1249 2.1281 1.0925 1.0661 1.0610 1.0777 1.0862 1.0889 1.0927 1.0946 2.2020 6.0610 6.0479 9.4388 1.0720 1.0786 1.0706 1.0617 1.0610 1.0620 1.0598 1.0377 1.0666 1.0868 1.0849 1.0967 1.1020 1.1037 1.1012 1.0984 1.0951 1.0847 1.0877 1.1019 1.0935 1.0962 1.0985
irintensity: 0.3200 0.0791 1.9667 0.7616 0.5442 3.3567 0.1430 0.3056 2.3693 2.4357 0.6611 3.4055 0.6128 1.3460 3.5066 4.6984 1.0820 1.5819 0.6086 0.6044 1.2056 0.5899 1.7983 4.4076 4.9905 11.1812 4.0348 10.8211 0.9500 6.3174 2.4252 47.5065 9.8075 11.9200 38.4250 1.1599 1.6558 9.3127 0.2790 0.0706 19.0942 70.1527 2.3849 0.5207 8.1871 3.7515 0.4426 20.2216 45.0358 0.5967 17.5356 4.5778 6.6482 8.7458 6.6436 23.3953 16.0656 13.8848 26.3945 19.8366 23.8899 37.3080 24.0319 4.3736 19.7645 87.1386 171.8698 7.4142 1.6354 4.8847 15.6391 4.5203 3.0226 9.1347 33.7581 2.2909 1.7572 3.9501 3.4880 6.4261 12.9487 6.6026 20.9917 54.6478 1.3487 2.0336 6.4912 8.9241 8.0439 24.6378 7.7600 9.6531 23.1190 8.8034 4.0442 10.9536 10.9612 2.2698 3.2230 153.7944 61.9575 49.0562 140.7114 39.5263 27.2590 32.3250 19.1715 3.9350 23.6659 48.4368 58.3755 40.5539 45.8018 67.9154 32.6952 8.4373 9.6437 2.9603 2.4568 10.2531 29.0013 37.1883 11.6143
temp: 298.150 k
press: 1.00000 atm
elementType: 8 8 7 6 6 6 6 6 6 6 6 6 6 6 6 6 6 6 6 6 1 1 1 1 1 1 1 1 1 1 1 1 1 1 1 1 1 1 1 1 1 1 1
symmnumber: 1
zpe: 961311.4 jmol-1
zpe.correction: 0.366144 hartree
zpe.thermalcorrener: 0.384772 hartree
zpe.thermalcorrenthalpy: 0.385716 hartree
zpe.thermalcorrgfe: 0.318801 hartree
zpe.sumelectzpe: -865.302090 hartree
zpe.sumelectthermal: -865.283462 hartree
zpe.sumelectthermalent: -865.282518 hartree
zpe.sumelectthermalfe: -865.349433 hartree
dipole: 1.3267 -0.2698 -1.6086
dipole: 2.1025
quadrupole: -116.0574 -119.7697 -113.8042
quadrupole: 7.5794 3.5513 -5.1410
quadrupole: 0.4864 -3.2260 2.7396 7.5794 3.5513 -5.1410
hfenergy: -865.6682343 hartree
pointgroup: C01 [X(C17H23N1O2)]
dipole: 0.5249166 0.199734 0.6072903 debye
polarizability: 228.3145323|-15.930348|160.8735889|3.4616288|0.0789069|175.1907965 unknown
InChI: InChI=1S/C17H23NO2/c1-14(19)20-17(15-7-3-2-4-8-15)10-12-18-11-6-5-9-16(18)13-17/h2-4,7-8,16H,5-6,9-13H2,1H3
charge 0 multiplicity 1
43 atoms
O  -0.356293 -1.190879 0.8542
O  -1.835756 -2.536771 -0.37421
N  2.515785 -0.042288 -0.862766
C  2.084657 0.418487 0.490465
C  -0.378284 -0.047911 -0.164554
C  0.637043 0.953551 0.436539
C  3.036436 1.521039 1.007655
C  0.159137 -0.537908 -1.526209
C  1.5952 -1.072844 -1.406855
C  3.916556 -0.53814 -0.861629
C  4.507368 1.052154 1.015355
C  4.902193 0.546625 -0.38994
C  -1.792866 0.545489 -0.190458
C  -2.47697 0.827497 -1.397518
C  -2.42776 0.864464 1.039337
C  -1.139059 -2.328919 0.644109
C  -3.760179 1.419111 -1.378189
C  -3.71082 1.449379 1.06178
C  -4.382841 1.733645 -0.150107
C  -1.031366 -3.253332 1.841635
H  2.113646 -0.440652 1.211829
H  0.31642 1.237007 1.455577
H  0.612723 1.866197 -0.18916
H  2.717628 1.822263 2.024754
H  2.936591 2.408208 0.350467
H  0.175455 0.329857 -2.212335
H  -0.506488 -1.308767 -1.947621
H  1.601798 -1.999661 -0.776816
H  1.957381 -1.360891 -2.411731
H  4.165343 -0.859921 -1.891029
H  4.022541 -1.439435 -0.198794
H  4.630511 0.229084 1.749619
H  5.173613 1.87492 1.337313
H  4.879891 1.389032 -1.108115
H  5.929781 0.134855 -0.38539
H  -2.023149 0.573947 -2.359984
H  -1.91808 0.637374 1.982988
H  -4.276197 1.625854 -2.322619
H  -4.18725 1.683179 2.020712
H  -5.379581 2.188656 -0.135941
H  -1.681706 -2.877956 2.653047
H  0.000892 -3.281082 2.226445
H  -1.366144 -4.263121 1.561343
