program: Gaussian 09
title: 000209613
version: EM64L-G09RevD.01
frameworkgroup: C1[X(C16H31NO2)]
method: RPBEPBE
basis: SDD
operation: Freq
keyword: #p
keyword: freq=noraman
keyword: PBEPBE/SDD
title: #p freq=noraman PBEPBE/SDD
converged: YES YES NO NO
title: Mulliken charges:
elementType: O O N C C C C C C C C C C C C C C C C H H H H H H H H H H H H H H H H H H H H H H H H H H H H H H H
charge: -0.345249 -0.455614 -0.336810 0.305295 0.348144 -0.206313 -0.059138 -0.554215 -0.527669 -0.487276 -0.821040 -0.786827 -0.790826 -0.270705 -0.113507 -0.425894 -0.022804 -0.663921 -0.720265 0.239688 0.223630 0.237888 0.226432 0.236921 0.216692 0.231201 0.208929 0.218736 0.210488 0.223968 0.213388 0.230769 0.214553 0.237804 0.212095 0.212000 0.200767 0.218183 0.207917 0.228844 0.217593 0.348454 0.249065 0.188377 0.201358 0.210868 0.220446 0.209041 0.216310 0.222229
chargesum: 0.00000
title: Mulliken charges with hydrogens summed into heavy atoms:
elementType: O O N C C C C C C C C C C C C C C C C
charge: -0.345249 -0.107160 -0.087746 0.305295 0.348144 0.033375 0.164491 -0.089894 -0.074055 -0.047146 -0.167848 -0.128117 -0.128927 0.148245 0.094409 0.020543 0.165573 -0.031249 -0.072685
polarizability: 2.09787327e+02 -4.71306124e-01 1.78543345e+02 2.15850908e+00 2.78267450e-01 1.58234316e+02
1716.lowfreq: -27.8765 -12.8866 -0.0008 -0.0007 -0.0004 4.5457 12.5362 26.5796 32.5938
frequency: -16.1947 26.1743 32.3591 47.0074 70.3892 88.5373 106.4259 122.2251 158.1159 167.0092 192.1474 197.8519 208.5333 216.6727 224.3103 241.9036 244.4138 264.4812 278.8237 286.6989 314.0099 320.7310 344.9600 374.9981 377.0731 414.8677 416.0810 445.5100 454.1509 472.1466 490.0301 504.3005 510.7981 565.0666 580.0293 630.2977 640.3165 670.7849 731.3106 778.5788 808.7702 818.1466 830.6593 845.6411 878.9336 902.1393 913.3916 916.4846 929.6798 932.2435 936.2841 939.9935 944.8205 952.1206 957.1393 983.9721 991.2086 1006.9616 1022.1425 1032.9075 1053.1811 1076.8053 1078.4094 1086.0814 1103.7204 1108.2158 1133.5584 1137.8342 1150.8539 1158.3424 1161.9056 1179.4926 1196.4076 1203.7940 1214.2949 1218.8340 1222.7345 1227.9597 1244.0272 1247.6740 1263.8283 1270.7657 1294.3077 1300.1837 1308.2872 1317.4502 1333.4057 1334.3739 1337.1957 1362.9811 1371.7194 1377.2313 1380.6590 1382.6463 1384.3385 1388.3607 1398.4846 1448.8106 1455.6500 1457.7260 1462.7209 1464.2621 1465.9106 1469.8181 1470.0746 1473.4977 1475.1957 1481.3668 1482.8384 1485.9379 1487.7303 1492.9814 1497.6829 2858.9588 2922.0138 2944.4639 2954.2325 2969.6367 2972.5573 2973.6748 2976.9705 2978.2417 2999.1412 3005.1425 3013.4245 3024.5771 3032.0073 3045.1732 3051.6878 3053.7528 3057.4881 3058.8498 3060.6644 3064.5449 3065.3187 3066.2593 3073.9511 3078.2971 3082.4768 3085.2314 3087.5819 3089.8667 3425.3689 3497.1850
redmass: 3.3631 3.7279 2.9514 3.0058 3.3017 2.2904 1.8983 2.0709 3.8667 2.3887 1.2427 1.3153 1.0875 1.4835 2.4915 1.2540 1.9117 2.8904 3.2192 3.0059 2.5878 2.3088 2.3923 2.5293 2.4210 2.0066 2.3274 2.4280 2.6619 2.6416 1.2397 2.5675 2.9693 3.9458 3.4240 2.6647 3.0339 1.6022 2.5349 2.2381 2.2659 2.1203 2.0068 2.8858 2.2962 2.1787 2.3036 1.2185 2.1810 1.7047 1.5332 1.6650 1.7405 1.7469 1.8913 2.3173 1.4279 2.0378 2.8686 1.8537 2.0525 1.4803 1.7320 2.8966 1.6930 1.7751 2.1240 2.2368 2.1152 1.6261 1.7922 1.9879 1.9030 1.6595 1.3959 1.7725 1.4764 1.8152 1.5729 1.3516 1.5794 1.8161 1.5504 1.5546 1.2917 1.9492 1.4392 1.2825 1.2876 1.3091 1.2399 1.3055 1.2901 1.3146 1.2781 1.2242 1.1968 1.1380 1.0710 1.0662 1.0846 1.1028 1.0552 1.0538 1.0621 1.0561 1.0788 1.0562 1.0739 1.0774 1.0602 1.0644 1.0672 1.0824 1.0700 1.0839 1.0591 1.0363 1.0356 1.0373 1.0355 1.0375 1.0603 1.0610 1.0658 1.0858 1.1027 1.0894 1.1025 1.0996 1.0913 1.0982 1.0980 1.1026 1.0991 1.0985 1.0992 1.0996 1.0989 1.0982 1.0992 1.0977 1.0741 1.0648
irintensity: 0.1446 0.0951 0.4346 0.0731 0.3196 0.5226 1.3244 0.4831 3.5059 1.2738 0.7103 1.9527 0.3957 3.0383 3.5033 0.5857 0.2730 0.6788 0.3427 1.0860 4.0389 2.1230 1.0388 0.3201 1.9875 0.3443 6.8335 2.4606 11.8297 10.8416 125.7926 1.7464 3.7312 1.4139 0.3105 9.1239 9.1331 57.0517 3.8204 2.1645 1.8436 5.0225 0.2734 13.3063 1.6275 8.1378 6.5214 4.6689 7.6122 3.1612 2.6909 2.7201 8.9375 0.6622 4.0947 10.7941 18.7478 38.1393 85.2959 9.0714 40.4132 19.7167 40.0180 10.8025 13.1437 46.0611 14.5187 11.6573 2.6790 28.0289 1.2957 43.1252 7.0625 1.4021 9.6528 1.7177 24.9468 0.4520 4.0540 2.4131 0.5607 2.2255 0.6915 3.3102 16.3271 4.2498 4.0476 18.8493 3.3551 4.4740 23.2395 21.5252 29.0874 12.2480 16.1053 31.9557 28.6900 22.5660 0.4782 7.8308 6.8648 4.4071 1.4797 9.2421 27.8395 0.6883 10.6244 5.2895 2.9211 0.7816 8.6838 26.6183 11.9655 89.3045 81.9430 34.8767 55.0934 31.9949 47.9730 22.4297 13.2778 63.2144 33.5420 29.4076 47.1262 35.3463 25.1215 42.0658 14.2343 10.8644 32.3090 47.0783 49.2608 64.3357 26.5846 17.9518 40.1554 33.6459 31.3095 86.3937 58.3176 16.5251 2.2049 25.1303
temp: 298.150 k
press: 1.00000 atm
elementType: 8 8 7 6 6 6 6 6 6 6 6 6 6 6 6 6 6 6 6 1 1 1 1 1 1 1 1 1 1 1 1 1 1 1 1 1 1 1 1 1 1 1 1 1 1 1 1 1 1 1
symmnumber: 1
zpe: 1171772.4 jmol-1
zpe.correction: 0.446305 hartree
zpe.thermalcorrener: 0.467496 hartree
zpe.thermalcorrenthalpy: 0.468440 hartree
zpe.thermalcorrgfe: 0.397148 hartree
zpe.sumelectzpe: -831.907098 hartree
zpe.sumelectthermal: -831.885906 hartree
zpe.sumelectthermalent: -831.884962 hartree
zpe.sumelectthermalfe: -831.956254 hartree
dipole: -0.4643 -2.2434 1.1178
dipole: 2.5491
quadrupole: -109.7638 -129.9337 -118.0238
quadrupole: -5.1878 1.3210 3.8593
quadrupole: 9.4766 -10.6932 1.2166 -5.1878 1.3210 3.8593
hfenergy: -832.3534025 hartree
pointgroup: C01 [X(C16H31N1O2)]
dipole: -0.250865 -0.8378959 0.4906951 debye
polarizability: 209.2198363|-1.5605695|178.5520408|5.3984553|-1.4635921|158.7931115 unknown
InChI: InChI=1S/C16H31NO2/c1-11(2)17-9-13(18)10-19-14-8-12-6-7-16(14,5)15(12,3)4/h11-14,17-18H,6-10H2,1-5H3
charge 0 multiplicity 1
50 atoms
O  0.138968 1.064454 -0.027801
O  1.926464 3.032143 -0.714444
N  3.686943 -0.099103 0.466082
C  -2.181662 0.464066 -0.669414
C  -3.295485 -0.405539 0.057742
C  -2.262678 -1.494685 0.530334
C  -1.182139 0.703208 0.508241
C  -1.508667 -0.590557 -1.61205
C  -1.205024 -0.650825 1.30436
C  -1.598492 -1.936494 -0.807096
C  -2.633859 1.74557 -1.374133
C  -4.02646 0.318338 1.216918
C  -4.388048 -0.942927 -0.8978
C  1.105938 1.478072 1.006599
C  2.33389 1.98891 0.24022
C  3.078271 0.847843 -0.49586
C  4.024501 -1.451248 -0.062638
C  2.748812 -2.311485 -0.2052
C  5.031207 -2.121116 0.89482
H  -2.690125 -2.325559 1.118263
H  -1.524854 1.54993 1.141868
H  -0.468528 -0.300283 -1.83141
H  -2.049046 -0.6478 -2.574267
H  -1.480834 -0.502248 2.363321
H  -0.210914 -1.133309 1.280464
H  -2.211791 -2.688714 -1.334631
H  -0.604987 -2.387697 -0.632346
H  -3.357352 1.522893 -2.180259
H  -3.113336 2.452891 -0.670737
H  -1.772342 2.265552 -1.832374
H  -4.749655 -0.368491 1.695998
H  -3.352475 0.689198 2.006942
H  -4.59993 1.183053 0.832466
H  -3.982999 -1.42035 -1.804852
H  -5.012913 -1.6920 -0.375009
H  -5.057593 -0.12354 -1.22174
H  0.665164 2.290876 1.622138
H  1.392777 0.621706 1.647077
H  3.022197 2.490593 0.946139
H  3.813187 1.314804 -1.190717
H  2.342926 0.302659 -1.113696
H  1.074253 2.708734 -1.114363
H  4.502344 0.322448 0.933341
H  4.504228 -1.375684 -1.07122
H  2.990862 -3.2924 -0.655154
H  2.29508 -2.476304 0.789397
H  1.995421 -1.820171 -0.847116
H  5.977001 -1.548168 0.951365
H  5.274888 -3.14305 0.554623
H  4.601966 -2.184698 1.912011
