program: Gaussian 09
title: 000209600
version: EM64L-G09RevD.01
frameworkgroup: C1[X(C15H25NO2)]
method: RPBEPBE
basis: SDD
operation: Freq
keyword: #p
keyword: freq=noraman
keyword: PBEPBE/SDD
title: #p freq=noraman PBEPBE/SDD
converged: YES YES NO NO
title: Mulliken charges:
elementType: O O N C C C C C C C C C C C C C C C H H H H H H H H H H H H H H H H H H H H H H H H H
charge: -0.336421 -0.452259 -0.315607 -0.117548 -0.409137 -0.046150 -0.299136 0.039409 -0.683750 -0.700590 0.375434 0.343955 0.484650 -0.592427 -0.576567 -0.821935 -0.815750 -0.817969 0.209546 0.221603 0.225296 0.209051 0.227924 0.221300 0.235508 0.212090 0.199952 0.231795 0.233192 0.208300 0.198092 0.237098 0.236431 0.354138 0.217294 0.248378 0.234366 0.226960 0.244061 0.228749 0.233031 0.224160 0.223482
chargesum: 0.00000
title: Mulliken charges with hydrogens summed into heavy atoms:
elementType: O O N C C C C C C C C C C C C C C C
charge: -0.336421 -0.098121 -0.080099 0.091998 0.037762 0.162901 0.150088 0.039409 -0.039913 -0.061005 0.375434 0.343955 0.484650 -0.355329 -0.340136 -0.121897 -0.115979 -0.137297
polarizability: 2.25539522e+02 -3.74699739e+00 1.90411011e+02 6.11958033e+00 4.93208915e+00 1.23223935e+02
1716.lowfreq: -5.6499 -0.0007 0.0003 0.0006 3.2189 8.3320 22.7586 25.0341 38.1322
frequency: 22.3203 24.9265 38.0136 40.2805 53.7088 60.0479 84.3379 94.6506 117.2820 131.6042 151.1920 161.5425 182.8435 203.2717 209.6929 225.3300 252.0367 257.6664 268.9463 279.6247 308.9677 311.9928 379.1333 381.5116 421.0520 446.5149 455.0712 471.1535 488.8162 503.1388 513.4109 563.4723 565.9587 580.8223 597.2942 677.6380 735.1994 783.6205 822.7628 844.7086 866.3174 892.2031 895.9191 910.0933 921.3574 932.6233 934.8505 939.5271 951.8926 992.8141 1012.4218 1017.7115 1034.5588 1041.7262 1047.6835 1050.6832 1066.5877 1097.6586 1102.1364 1129.3167 1137.6145 1149.8311 1174.6192 1197.4955 1218.6864 1227.1843 1243.9223 1253.8741 1307.1987 1317.8959 1324.0841 1334.3873 1346.5809 1364.0009 1365.8550 1373.9381 1379.8903 1389.6719 1393.8500 1398.0338 1401.6962 1415.9495 1435.4337 1448.4551 1458.6184 1462.5585 1464.5862 1467.0241 1470.3644 1474.3365 1476.1050 1480.6639 1481.4172 1484.0053 1485.6594 1493.3236 1599.3343 1614.6459 2925.3407 2966.4794 2973.0175 2973.0897 2975.1814 2976.4082 2978.1022 2987.8487 3019.7466 3039.0722 3053.4169 3054.8976 3056.3672 3058.4340 3060.7754 3070.8189 3071.0516 3082.8154 3084.5798 3092.7861 3095.3293 3111.1681 3115.9302 3408.5384 3513.9519
redmass: 3.7704 3.6950 1.3358 1.7463 3.7375 3.6688 1.1403 2.2694 1.2504 2.7641 4.0804 2.9181 2.6795 1.4711 1.5247 2.9121 1.5188 1.7286 2.5575 2.6933 3.1316 4.2983 2.4144 4.3087 2.4878 2.1262 2.9479 1.3799 3.2249 3.0557 3.0836 4.2444 4.3222 3.0221 3.3253 1.5596 3.6634 4.1018 2.4405 2.8164 1.3308 1.3161 2.5332 1.2527 1.9278 2.8146 2.3117 1.4942 3.5105 1.8851 1.7557 1.5378 1.8139 1.5363 1.5329 1.5734 1.9160 1.9711 2.8755 2.1287 3.6799 1.5134 2.0932 1.6969 1.4522 1.3826 1.4031 1.3889 1.3870 1.2734 5.6295 1.3220 1.3339 1.3072 6.5704 1.2755 1.3465 1.2298 1.2416 1.2348 1.2612 2.7100 1.7344 1.1587 1.0979 1.0557 1.0505 1.0634 1.0903 1.0730 1.0831 1.1053 1.1225 1.1012 1.0769 1.3648 7.2567 5.8827 1.0676 1.0357 1.0407 1.0574 1.0406 1.0469 1.0505 1.0563 1.0855 1.0917 1.0949 1.0977 1.0954 1.1046 1.0987 1.0989 1.0981 1.0996 1.0997 1.1002 1.0995 1.0912 1.0918 1.0736 1.0649
irintensity: 0.1111 0.1077 0.5520 0.0908 0.1954 0.1723 0.1122 1.1704 1.3888 0.8682 1.0057 6.7134 2.6829 2.4987 3.1494 0.2085 1.3394 2.5300 1.4492 5.7328 7.3303 3.3825 0.2425 3.3057 0.0981 27.4933 7.7904 141.8055 10.2101 26.2980 0.1358 0.5353 0.4975 5.4382 7.2501 93.1676 1.7222 5.9734 3.4711 12.0851 26.9185 0.3479 49.4773 2.6063 3.4234 19.8442 1.1484 2.9047 12.9901 36.2489 9.7436 3.2230 2.3187 2.1083 2.2471 25.7166 49.6434 21.6195 22.4039 10.8245 127.9307 22.4038 71.5640 71.6375 10.1029 10.0836 6.4812 1.0263 9.6960 4.5811 6.7656 2.1774 3.4730 9.9481 0.6453 34.5018 31.0292 27.6388 18.1146 13.0077 10.3561 0.9306 19.6709 18.5481 6.1504 6.3922 1.1778 27.9184 5.7209 8.2235 9.2130 2.7613 13.3182 26.7877 23.8267 71.7873 4.5724 5.5050 69.3053 32.6180 52.5891 3.1314 32.1669 49.7154 16.1832 26.9365 15.2547 53.7396 21.4136 13.1194 40.6901 15.2208 9.5584 49.3150 67.7858 16.3340 21.2113 42.4247 11.8757 28.7099 15.4631 2.3891 16.7545
temp: 298.150 k
press: 1.00000 atm
elementType: 8 8 7 6 6 6 6 6 6 6 6 6 6 6 6 6 6 6 1 1 1 1 1 1 1 1 1 1 1 1 1 1 1 1 1 1 1 1 1 1 1 1 1
symmnumber: 1
zpe: 973805.6 jmol-1
zpe.correction: 0.370903 hartree
zpe.thermalcorrener: 0.392578 hartree
zpe.thermalcorrenthalpy: 0.393522 hartree
zpe.thermalcorrgfe: 0.318338 hartree
zpe.sumelectzpe: -790.357469 hartree
zpe.sumelectthermal: -790.335794 hartree
zpe.sumelectthermalent: -790.334850 hartree
zpe.sumelectthermalfe: -790.410034 hartree
dipole: -0.0701 -2.0886 1.0802
dipole: 2.3524
quadrupole: -97.8681 -115.0978 -110.9539
quadrupole: 4.6451 -0.7571 4.1289
quadrupole: 10.1052 -7.1245 -2.9807 4.6451 -0.7571 4.1289
hfenergy: -790.7283721 hartree
pointgroup: C01 [X(C15H25N1O2)]
dipole: 0.0080441 0.8364082 0.3961283 debye
polarizability: 225.7911009|-3.234812|189.8543656|-4.67712|-7.409534|123.5290027 unknown
InChI: InChI=1S/C15H25NO2/c1-10(2)16-8-14(17)9-18-15-12(4)6-11(3)7-13(15)5/h6-7,10,14,16-17H,8-9H2,1-5H3
charge 0 multiplicity 1
43 atoms
O  -0.118301 -1.004385 -0.393564
O  1.628555 -3.120918 -0.392306
N  3.339077 0.093008 0.619126
C  1.920994 -1.950729 0.450738
C  2.884115 -0.986408 -0.284475
C  3.944142 1.291526 -0.024573
C  0.614648 -1.268998 0.874772
C  -1.370015 -0.3370 -0.238587
C  5.242244 0.995817 -0.825927
C  4.19345 2.362841 1.056733
C  -1.405583 1.067384 -0.451695
C  -2.540495 -1.086228 0.04732
C  -3.849274 1.014636 -0.061334
C  -2.656013 1.721663 -0.356693
C  -3.770433 -0.38583 0.126307
C  -0.137204 1.826417 -0.794417
C  -2.486984 -2.589823 0.249421
C  -5.175632 1.745993 0.062991
H  2.41906 -2.362677 1.348992
H  2.339996 -0.521371 -1.128621
H  3.702551 -1.605594 -0.71591
H  3.183373 1.679559 -0.733146
H  0.829271 -0.318986 1.398512
H  0.009099 -1.938879 1.51515
H  3.953657 -0.268225 1.364692
H  5.614005 1.909843 -1.326087
H  6.040013 0.628643 -0.151021
H  5.071409 0.230316 -1.604638
H  3.256978 2.596439 1.592346
H  4.589619 3.292194 0.609491
H  4.934717 2.005137 1.798716
H  -2.699908 2.806076 -0.520992
H  -4.687019 -0.952829 0.33507
H  0.944377 -2.821236 -1.048966
H  -0.326864 2.912796 -0.835116
H  0.663699 1.638329 -0.055604
H  0.259835 1.507018 -1.776198
H  -3.423116 -3.065732 -0.090814
H  -1.643184 -3.038787 -0.3010
H  -2.357413 -2.851301 1.318071
H  -5.311933 2.156341 1.082799
H  -5.238413 2.595127 -0.640865
H  -6.028701 1.074032 -0.136899
