program: Gaussian 09
title: 000209609
version: EM64L-G09RevD.01
frameworkgroup: C1[X(C19H25NO2)]
method: RPBEPBE
basis: SDD
operation: Freq
keyword: #p
keyword: freq=noraman
keyword: PBEPBE/SDD
title: #p freq=noraman PBEPBE/SDD
converged: YES YES NO NO
title: Mulliken charges:
elementType: O O N C C C C C C C C C C C C C C C C C C C H H H H H H H H H H H H H H H H H H H H H H H H H
charge: -0.276246 -0.499647 -0.407767 0.014433 -0.475540 -0.034876 -0.358362 -0.675010 -0.686797 0.501057 -0.704879 0.325672 0.494397 -0.477877 -0.353226 -0.361139 -0.395991 -0.378299 -0.449484 -0.225962 -0.222731 -0.251805 0.215582 0.233425 0.209353 0.225152 0.275806 0.225605 0.216759 0.203665 0.220881 0.220891 0.235642 0.199078 0.214736 0.219726 0.225655 0.374761 0.227574 0.239985 0.325119 0.244910 0.246467 0.229740 0.222203 0.222227 0.225136
chargesum: 0.00000
title: Mulliken charges with hydrogens summed into heavy atoms:
elementType: O O N C C C C C C C C C C C C C C C C C C C
charge: -0.276246 -0.124886 -0.131961 0.230015 -0.032762 0.190276 0.084003 -0.029574 -0.037342 0.501057 -0.259498 0.325672 0.494397 -0.250303 -0.113241 -0.036020 -0.151081 -0.131832 -0.219744 -0.003759 -0.000504 -0.026669
polarizability: 3.10138639e+02 6.23573389e+00 1.80095387e+02 -4.17434399e+00 -5.45761786e+00 1.74214288e+02
1716.lowfreq: -5.5572 -3.4336 -0.0444 -0.0011 -0.0004 5.4862 11.5342 21.2429 23.6202
frequency: 11.2858 20.8487 23.2914 35.2930 39.4274 54.5852 63.8974 76.4401 87.7443 130.4357 166.9822 183.1832 201.1251 224.5555 230.6360 254.0680 261.4299 295.0078 317.8997 334.9220 338.0685 373.1017 405.0014 415.4152 425.4488 436.8219 438.2843 464.9919 506.9219 511.6351 537.5414 587.4493 596.5983 616.6285 636.8969 677.9899 700.9339 705.8316 726.1217 754.7790 771.8097 797.9563 811.8198 824.7239 835.4979 848.7924 852.7131 855.2674 897.9900 905.5547 911.0808 912.7151 940.4214 945.6319 962.9631 973.1486 975.7657 977.5597 990.3989 993.5345 1007.6723 1026.6265 1026.8726 1062.1485 1079.5219 1081.2698 1099.5765 1119.2582 1136.4350 1150.9328 1169.9419 1172.0190 1184.0882 1187.2973 1189.3224 1196.2877 1206.7688 1224.1397 1230.4906 1252.5541 1276.4175 1284.4887 1314.5040 1319.6329 1321.6532 1332.6852 1336.7525 1342.7809 1360.5664 1374.2791 1380.6821 1383.3654 1391.9206 1407.9886 1420.1863 1439.1898 1442.2277 1448.5037 1455.8164 1459.9059 1463.0627 1467.8090 1480.7748 1483.6887 1484.0470 1502.6018 1584.5912 1593.0693 1613.2588 1621.0525 2945.1250 2955.3995 2965.6474 2972.1867 2976.6542 2988.7182 3000.1484 3010.5036 3035.9704 3062.7078 3065.6475 3074.9425 3076.8495 3094.6016 3111.8296 3115.7735 3119.6688 3124.6143 3132.1277 3136.3076 3142.5160 3148.5698 3159.8882 3160.1321 3457.1169
redmass: 4.9308 3.7204 3.7442 2.8510 4.4745 4.5615 4.1031 4.6003 4.1542 4.6108 4.4897 4.4580 1.0463 1.4185 2.2685 2.7880 3.0513 4.4300 3.3346 2.5176 3.1101 2.4532 2.8177 2.9930 2.6041 2.7319 2.2728 2.9068 3.0704 4.3445 3.4008 2.2879 4.2348 6.3102 6.5529 2.2017 3.3455 2.2194 2.1605 2.5278 1.1644 2.8186 1.8716 3.8085 1.5143 2.9169 1.3892 1.2904 2.5240 1.4647 1.6539 1.3702 1.4027 1.5604 1.5394 4.6008 1.3932 1.3856 5.6007 1.3535 2.8918 2.2086 2.0892 2.9437 2.0178 1.9115 3.1943 1.3740 2.1890 1.8127 1.0589 2.0478 1.2020 1.3189 1.3422 2.2296 1.8337 2.4517 1.3585 1.1685 1.1859 1.5987 1.3961 1.3287 1.2858 1.2159 1.3534 1.2361 1.2568 1.2172 5.0927 6.3057 1.2251 1.4667 2.8958 2.0946 1.1831 1.1015 1.0871 1.1530 1.0510 1.0575 1.0685 2.1953 1.0570 2.4144 6.8717 6.1244 6.0787 6.2271 1.0724 1.0745 1.0595 1.0360 1.0386 1.0588 1.0835 1.1000 1.0980 1.1055 1.0985 1.0981 1.0988 1.1002 1.0864 1.0893 1.0861 1.0888 1.0914 1.0722 1.0961 1.0864 1.1012 1.0957 1.0752
irintensity: 0.7018 1.3194 0.1523 0.3429 1.1426 0.8352 2.1566 0.8802 2.1562 0.2979 4.6931 0.1896 0.3109 1.0431 4.3345 2.9658 0.9808 0.7972 0.5252 0.3832 7.0497 6.1611 0.2583 2.2534 8.5376 0.2029 4.8461 6.2322 11.5194 18.1380 4.7020 32.0037 19.1546 0.6977 1.8857 57.0835 7.8962 28.9538 29.4944 34.2981 96.2826 20.4258 17.9229 1.1692 15.7685 24.8752 24.8339 8.1822 5.9015 8.2231 8.1568 0.8280 1.4849 11.8887 3.7316 65.7775 2.4946 1.3564 0.0403 0.5792 6.4316 10.4952 41.8933 29.7125 13.1633 9.1786 30.9148 17.9830 15.4644 11.3204 0.2401 83.6339 14.0992 39.3245 68.7792 5.6239 141.2164 18.6590 38.8853 23.3515 22.9872 2.5650 2.5648 0.0199 5.7803 59.7408 11.0619 27.8381 9.4659 27.4755 10.7754 4.7339 26.0870 39.5201 2.2339 6.9791 6.6550 6.0233 6.3281 18.6852 1.0296 15.8810 3.5394 21.6836 21.9953 182.7470 12.3441 1.7810 7.6997 50.3232 29.5653 40.0449 34.3409 30.6271 25.6696 55.5715 12.5357 14.3418 35.9355 18.1336 7.9441 54.5910 48.9788 45.4394 8.7038 26.2202 0.9616 8.3529 16.8896 320.1290 44.7175 19.2533 24.9197 10.6491 0.3445
temp: 298.150 k
press: 1.00000 atm
elementType: 8 8 7 6 6 6 6 6 6 6 6 6 6 6 6 6 6 6 6 6 6 6 1 1 1 1 1 1 1 1 1 1 1 1 1 1 1 1 1 1 1 1 1 1 1 1 1
symmnumber: 1
zpe: 1043617.6 jmol-1
zpe.correction: 0.397493 hartree
zpe.thermalcorrener: 0.419521 hartree
zpe.thermalcorrenthalpy: 0.420466 hartree
zpe.thermalcorrgfe: 0.342197 hartree
zpe.sumelectzpe: -942.548039 hartree
zpe.sumelectthermal: -942.526010 hartree
zpe.sumelectthermalent: -942.525066 hartree
zpe.sumelectthermalfe: -942.603334 hartree
dipole: -5.4155 0.6079 -0.2218
dipole: 5.4540
quadrupole: -92.4194 -128.9679 -133.9875
quadrupole: -2.4690 0.2761 -3.4119
quadrupole: 26.0389 -10.5096 -15.5293 -2.4690 0.2761 -3.4119
hfenergy: -942.9455317 hartree
pointgroup: C01 [X(C19H25N1O2)]
dipole: -1.9739646 0.6944099 0.4749531 debye
polarizability: 301.439738|-18.9014501|185.9215189|-28.284142|4.2464515|177.0870573 unknown
InChI: InChI=1S/C19H25NO2/c1-15(2)20-13-18(21)14-22-19-10-8-17(9-11-19)12-16-6-4-3-5-7-16/h3-11,15,18,20-21H,12-14H2,1-2H3
charge 0 multiplicity 1
47 atoms
O  -1.718195 -0.477566 -1.77788
O  -2.736508 -0.080385 1.420543
N  -5.030651 1.207761 1.526042
C  -3.219955 0.323299 0.09971
C  -4.760588 0.542872 0.227907
C  -4.872525 2.693446 1.581683
C  -2.903318 -0.75597 -0.953144
C  -5.963088 3.454857 0.784912
C  -4.849465 3.135967 3.058604
C  2.227399 -1.486951 -0.549497
C  3.647299 -1.890782 -0.158297
C  -0.437642 -0.81873 -1.289801
C  4.749699 -0.919199 -0.583603
C  1.18334 -1.470707 0.405091
C  1.908274 -1.142635 -1.890985
C  -0.147058 -1.136373 0.057166
C  0.592103 -0.814584 -2.263701
C  4.600483 0.480881 -0.403657
C  5.965064 -1.403387 -1.129865
C  5.641009 1.369593 -0.752077
C  7.009659 -0.517232 -1.481423
C  6.852004 0.874476 -1.291706
H  -2.730555 1.269727 -0.217862
H  -5.262187 -0.443696 0.246724
H  -5.136852 1.098983 -0.6572
H  -3.884634 2.918541 1.134239
H  -5.918176 0.910561 1.951939
H  -2.813692 -1.736646 -0.445836
H  -3.716217 -0.801593 -1.700725
H  -6.95888 3.296366 1.242193
H  -5.760058 4.541505 0.783142
H  -6.009361 3.121283 -0.267648
H  -4.036608 2.62889 3.606703
H  -5.807969 2.891333 3.557208
H  -4.700265 4.227522 3.138186
H  3.880312 -2.888519 -0.582249
H  3.684102 -2.013896 0.943193
H  -3.425535 0.336199 2.04047
H  1.408091 -1.714128 1.451528
H  2.702079 -1.130794 -2.647461
H  -0.923597 -1.076369 0.826577
H  0.337779 -0.559936 -3.297515
H  3.659292 0.870244 0.002262
H  6.094055 -2.482792 -1.281765
H  5.508203 2.447873 -0.605303
H  7.941066 -0.911527 -1.904199
H  7.65876 1.564419 -1.564218
