program: Gaussian 09
title: 000209590
version: EM64L-G09RevD.01
frameworkgroup: C1[X(C14H23ClN2O)]
method: RPBEPBE
basis: SDD
operation: Freq
keyword: #p
keyword: freq=noraman
keyword: PBEPBE/SDD
title: #p freq=noraman PBEPBE/SDD
converged: YES YES NO NO
title: Mulliken charges:
elementType: Cl O N N C C C C C C C C C C C C C C H H H H H H H H H H H H H H H H H H H H H H H
charge: -0.089589 -0.435682 -0.345523 -0.425532 -0.088047 -0.415530 -0.443095 -0.338140 -0.367431 -0.340672 0.293552 0.328091 -0.687785 -0.362819 -0.381031 -0.838280 -0.240431 -0.111576 0.223217 0.214533 0.224781 0.239217 0.205764 0.190354 0.206272 0.180657 0.205656 0.251678 0.193788 0.195027 0.361711 0.341648 0.219264 0.212215 0.209674 0.223310 0.251837 0.229891 0.236483 0.224908 0.247634
chargesum: 0.00000
title: Mulliken charges with hydrogens summed into heavy atoms:
elementType: Cl O N N C C C C C C C C C C C C C C
charge: -0.089589 -0.094034 -0.093845 -0.063820 0.135170 0.023784 0.001886 0.058487 0.018882 0.048143 0.293552 0.328091 -0.046632 -0.139509 -0.129194 -0.146998 0.007202 -0.111576
polarizability: 2.44635346e+02 1.81042564e+01 1.83524980e+02 7.14650056e+00 -1.64942146e+01 1.27174910e+02
1716.lowfreq: -4.8829 0.0014 0.0019 0.0022 3.5196 8.9669 17.4405 19.2889 41.3778
frequency: 17.1771 19.1612 41.3499 50.5124 63.9971 72.6964 90.6123 104.1318 129.8966 140.9826 152.8312 166.5626 184.8788 202.7254 211.6902 231.1755 236.9631 255.2361 310.7891 331.8817 335.5613 372.6639 394.0109 419.7239 438.1930 465.2300 489.5907 497.7835 524.0467 540.4440 588.4408 654.8405 707.1608 715.7353 736.5190 770.7496 796.9204 800.9750 807.0720 814.7490 862.4339 870.6792 894.5918 922.9173 924.3719 932.5975 971.9386 990.0397 1000.1318 1024.3271 1034.3617 1041.1348 1073.0349 1083.8208 1089.6039 1104.3621 1124.3345 1126.9806 1147.0203 1152.2892 1194.5189 1195.8041 1218.9679 1241.6000 1249.2031 1268.6795 1270.2983 1280.3785 1285.3070 1310.0108 1320.4230 1332.0722 1351.1639 1360.0322 1373.7037 1377.7336 1386.0799 1393.8485 1396.7926 1406.8085 1446.3067 1453.2202 1464.5824 1467.4336 1469.4971 1473.4601 1478.6103 1479.8901 1485.2491 1487.6286 1496.6002 1510.5447 1582.2886 1613.6660 2878.0301 2917.2150 2923.7442 2950.4670 2957.3489 2970.4277 2975.1579 2993.9445 3005.3308 3007.6878 3017.7994 3036.4205 3045.7769 3071.4451 3072.6385 3075.5986 3086.4604 3149.3975 3150.2694 3172.0205 3389.6290 3411.7826 3522.8314
redmass: 4.9179 3.8990 2.5634 2.4946 3.3649 3.8174 3.8450 3.2403 2.8726 2.3228 3.0174 2.2252 2.5071 1.4821 3.6869 1.1353 4.0956 3.9779 3.6270 4.0886 3.9354 4.8332 2.5244 1.2402 2.9103 3.1608 3.8262 3.9415 4.0055 3.3640 3.3441 5.1432 2.7150 1.3930 1.0758 2.2505 1.5421 1.1664 3.1738 1.6367 3.6695 1.3485 1.8755 2.3116 1.3475 1.2136 1.7359 1.5558 3.1433 2.7715 2.4560 1.5072 2.3920 2.3504 1.9156 2.3653 2.8563 1.5286 1.9226 2.2419 2.1590 1.5492 1.3132 1.3512 1.2321 1.3620 1.3241 1.1415 1.0899 2.0342 1.3612 1.3803 1.4967 1.5096 3.0006 1.2619 1.4372 1.2471 1.3327 3.4746 1.2013 1.4427 1.1206 1.0770 1.0575 1.0642 1.0424 1.0771 1.1366 1.2246 1.1679 1.8998 5.8819 6.4793 1.0702 1.0684 1.0707 1.0401 1.0621 1.0603 1.0363 1.0861 1.0906 1.0989 1.0962 1.1029 1.0882 1.1007 1.0890 1.0994 1.0960 1.0896 1.0898 1.0966 1.0759 1.0739 1.0655
irintensity: 0.0618 0.1993 0.1572 0.7041 1.1018 1.0384 2.7540 0.8757 1.5365 3.4548 4.6567 3.7694 5.0266 0.0891 2.8531 0.1000 2.6209 1.3947 2.3845 0.4286 14.1864 6.5564 2.6449 125.6901 5.1320 2.4919 2.8873 24.0955 0.8864 9.5590 24.1716 10.6343 3.7182 25.9673 12.6529 89.2850 37.1123 2.0127 15.9829 46.7432 64.5431 20.9893 7.6090 23.3683 0.1811 3.0211 8.1016 17.9978 37.1459 32.3163 1.8939 7.9347 46.6062 8.7120 3.1504 55.6214 4.3552 4.2093 83.1223 12.1006 8.6904 33.5096 55.5059 6.7575 28.2042 3.1710 5.0630 2.1089 0.1154 18.2260 10.9917 0.8191 4.2602 3.2005 17.8885 22.5973 14.7210 8.0764 11.5494 15.0015 28.4185 14.6867 27.9531 1.7921 15.5597 2.5609 13.0638 18.7299 18.9616 48.4058 37.9531 340.8509 33.4180 44.2094 103.0257 104.1280 80.1539 39.0361 11.1352 56.8461 32.8130 28.0216 13.8261 1.0276 24.6034 61.8117 73.4751 82.5046 20.2526 50.6225 18.8968 15.6590 2.2426 9.0781 254.7990 0.3774 6.7648
temp: 298.150 k
press: 1.00000 atm
elementType: 17 8 7 7 6 6 6 6 6 6 6 6 6 6 6 6 6 6 1 1 1 1 1 1 1 1 1 1 1 1 1 1 1 1 1 1 1 1 1 1 1
symmnumber: 1
zpe: 916103.0 jmol-1
zpe.correction: 0.348925 hartree
zpe.thermalcorrener: 0.369624 hartree
zpe.thermalcorrenthalpy: 0.370569 hartree
zpe.thermalcorrgfe: 0.296676 hartree
zpe.sumelectzpe: -1190.648382 hartree
zpe.sumelectthermal: -1190.627683 hartree
zpe.sumelectthermalent: -1190.626739 hartree
zpe.sumelectthermalfe: -1190.700632 hartree
dipole: 6.1111 -0.3712 -0.6862
dipole: 6.1607
quadrupole: -126.6773 -126.3204 -114.8606
quadrupole: -7.7217 -1.3551 -8.4477
quadrupole: -4.0579 -3.7010 7.7588 -7.7217 -1.3551 -8.4477
hfenergy: -1190.9973075 hartree
pointgroup: C01 [X(C14H23Cl1N2O1)]
dipole: 2.417535 0.0825665 0.1537027 debye
polarizability: 241.8919468|-24.5399888|170.1374385|-4.9446858|-29.6206785|143.3058502 unknown
InChI: InChI=1S/C14H23ClN2O/c1-3-4-7-16-9-13(18)10-17-14-6-5-12(15)8-11(14)2/h5-6,8,13,16-18H,3-4,7,9-10H2,1-2H3
charge 0 multiplicity 1
41 atoms
Cl -5.708396 1.891143 -0.42356
O  0.368338 -3.940711 0.378933
N  2.558073 -0.874426 0.400892
N  -0.368753 -0.88243 0.352109
C  1.0421 -2.805944 1.035607
C  2.147867 -2.266916 0.085992
C  0.014352 -1.73675 1.48219
C  3.59298 -0.324579 -0.512919
C  3.964499 1.120831 -0.132489
C  5.029724 1.732786 -1.070997
C  -1.612153 -0.241077 0.217977
C  -1.751766 0.775857 -0.790432
C  5.41314 3.175199 -0.676904
C  -2.743522 -0.576701 1.015755
C  -3.001077 1.408479 -0.967734
C  -0.567091 1.156317 -1.658772
C  -3.988949 0.059786 0.824304
C  -4.102367 1.047641 -0.167201
H  1.489435 -3.258909 1.938548
H  1.736766 -2.261303 -0.942951
H  2.996134 -2.989402 0.082988
H  -0.859019 -2.282328 1.875365
H  0.433117 -1.136605 2.321193
H  4.516813 -0.954311 -0.529684
H  3.179483 -0.343732 -1.541318
H  4.345251 1.141998 0.911113
H  3.047962 1.743683 -0.145911
H  2.8608 -0.780315 1.382362
H  5.93582 1.093292 -1.064965
H  4.647762 1.722462 -2.112109
H  0.462082 -0.391854 -0.011419
H  -0.179706 -3.567561 -0.361325
H  6.170233 3.593117 -1.365072
H  4.530483 3.841535 -0.700434
H  5.831692 3.20938 0.346599
H  -2.667916 -1.336324 1.799109
H  -3.111768 2.182178 -1.734417
H  -0.189746 0.285916 -2.232198
H  -0.841308 1.942829 -2.380974
H  0.282355 1.540769 -1.056894
H  -4.848625 -0.210722 1.444442
