program: Gaussian 09
title: 000209585
version: EM64L-G09RevD.01
frameworkgroup: C1[X(C14H24N2O)]
method: RPBEPBE
basis: SDD
operation: Freq
keyword: #p
keyword: freq=noraman
keyword: PBEPBE/SDD
title: #p freq=noraman PBEPBE/SDD
converged: YES YES NO NO
title: Mulliken charges:
elementType: O N N C C C C C C C C C C C C C C H H H H H H H H H H H H H H H H H H H H H H H H
charge: -0.445366 -0.330007 -0.441682 -0.053570 -0.452888 -0.437099 -0.054082 0.486375 -0.690556 -0.680614 -0.575883 -0.674979 0.489325 0.518991 -0.600525 -0.826009 -0.817547 0.216517 0.217817 0.220780 0.234753 0.245222 0.205987 0.254081 0.287000 0.207534 0.197470 0.231417 0.224440 0.214505 0.200371 0.271203 0.218375 0.352445 0.232505 0.220447 0.231094 0.228027 0.218552 0.228228 0.227349
chargesum: 0.00000
title: Mulliken charges with hydrogens summed into heavy atoms:
elementType: O N N C C C C C C C C C C C C C C
charge: -0.092921 -0.075927 -0.154683 0.162946 -0.014292 0.042876 0.151905 0.486375 -0.054135 -0.041297 -0.304680 -0.456604 0.489325 0.518991 -0.368020 -0.146441 -0.143419
polarizability: 2.40284402e+02 6.97866369e-01 1.69905297e+02 -1.18084679e+01 5.89272498e+00 1.19768788e+02
1716.lowfreq: -13.6273 -10.4746 -0.0005 -0.0004 0.0003 5.4436 13.7355 21.8086 34.4000
frequency: -12.3427 20.0055 34.3326 38.2649 50.9119 59.3176 65.4902 113.0503 129.9749 173.6076 188.8384 194.0045 217.2561 220.5270 232.6560 263.5518 275.1078 289.1434 317.8108 342.4689 387.0865 410.5556 423.0883 429.9521 457.6516 482.1453 503.4075 528.3573 529.1074 533.9918 579.4794 603.2504 638.1479 648.1098 703.7856 788.0109 810.5983 841.0235 856.2516 879.2531 891.8260 907.1635 909.6696 923.3017 932.2852 955.6539 978.8849 985.1420 994.2632 1017.0682 1043.6486 1047.1557 1048.3631 1075.5564 1108.8062 1128.3562 1131.7611 1153.6130 1174.0947 1178.9064 1209.9167 1219.2560 1238.8634 1271.6542 1300.4447 1310.9479 1323.2114 1328.1478 1333.1315 1349.7035 1367.4278 1369.9168 1371.8039 1388.1443 1392.6041 1393.9925 1394.5007 1420.8589 1441.4664 1449.0625 1457.8956 1460.6277 1461.8383 1468.7368 1471.7305 1473.3120 1477.2066 1480.3077 1482.3472 1491.9288 1516.0604 1608.5210 1622.1894 2926.4788 2967.6360 2972.7849 2973.1332 2974.2414 2992.8353 2994.7300 3014.2822 3036.9357 3052.9860 3053.3437 3058.9441 3060.0878 3071.1831 3072.1260 3079.6303 3083.2119 3091.6044 3101.4620 3118.6710 3143.0224 3438.7282 3524.1499 3563.1363
redmass: 3.5315 3.8569 3.0106 1.0471 4.0750 1.0290 3.6093 3.6873 3.9953 4.0338 3.2194 1.0435 2.8800 1.2277 3.0653 2.5447 2.6492 2.4791 2.7258 3.1489 2.3528 2.2230 1.1412 1.8580 3.1384 1.2381 5.0226 2.4873 2.9419 3.4846 3.7860 3.1243 2.2573 2.8006 1.9889 3.5166 2.0404 1.4807 1.3632 1.3918 2.5420 1.8525 1.4532 2.5100 1.3986 2.8872 4.9510 1.8393 2.0202 1.4733 1.5374 1.8167 1.8480 2.0736 2.5724 2.2643 2.2633 1.7876 2.0319 1.4542 1.8939 1.4667 1.3657 1.2235 1.2738 1.4316 1.3169 1.2857 2.6372 1.3200 1.2422 1.3281 1.2372 1.2343 1.9887 1.3858 1.6867 2.0325 1.6272 1.1716 1.1851 1.0889 1.0545 1.0466 1.0800 1.0714 1.1021 1.0590 1.0785 1.5110 1.9553 5.4585 5.8187 1.0656 1.0356 1.0381 1.0381 1.0369 1.0822 1.0612 1.0901 1.0888 1.0975 1.0955 1.1041 1.0987 1.0980 1.0992 1.0989 1.0995 1.1000 1.0907 1.0916 1.0909 1.0746 1.0657 1.0763
irintensity: 0.2125 0.1615 0.0445 0.4391 0.6846 0.4711 0.9026 1.7765 1.1562 3.3792 3.8890 0.2425 0.5792 0.4866 0.2617 0.1547 6.3015 6.3967 4.2234 3.5018 1.8811 6.6381 108.2359 2.2179 5.5736 192.5034 0.9921 36.1963 47.4222 4.7895 7.4815 8.4190 77.9474 8.5712 8.9070 10.9138 4.2777 46.1939 1.9803 8.3259 6.2027 4.3819 2.4145 6.5453 0.2829 11.6873 0.7486 50.2436 37.7881 0.5577 1.8896 7.3199 29.8362 30.2206 3.0598 22.2555 15.5108 37.1767 50.4107 1.3825 76.5198 16.2601 7.0339 8.2627 2.8909 2.6753 7.7079 2.0324 34.0538 15.3766 1.8774 4.2826 44.0441 31.9478 48.3532 18.3788 0.6132 22.2679 19.0087 9.1142 6.8339 1.8248 1.8023 13.1652 24.1234 6.7942 14.0515 6.8527 12.1482 72.3707 106.9783 54.1300 292.7621 60.4961 30.9754 47.7235 27.7060 36.1317 21.6557 22.5829 3.7115 81.0430 13.8893 31.6435 10.1456 4.7571 82.2037 48.2870 19.0840 21.9569 43.5058 27.3750 16.7156 6.0305 1.5214 16.0931 21.9152
temp: 298.150 k
press: 1.00000 atm
elementType: 8 7 7 6 6 6 6 6 6 6 6 6 6 6 6 6 6 1 1 1 1 1 1 1 1 1 1 1 1 1 1 1 1 1 1 1 1 1 1 1 1
symmnumber: 1
zpe: 936426.0 jmol-1
zpe.correction: 0.356666 hartree
zpe.thermalcorrener: 0.375950 hartree
zpe.thermalcorrenthalpy: 0.376894 hartree
zpe.thermalcorrgfe: 0.307522 hartree
zpe.sumelectzpe: -731.268010 hartree
zpe.sumelectthermal: -731.248727 hartree
zpe.sumelectthermalent: -731.247782 hartree
zpe.sumelectthermalfe: -731.317154 hartree
dipole: -1.9164 -2.3165 0.2255
dipole: 3.0149
quadrupole: -94.5365 -102.9158 -108.2354
quadrupole: 2.6060 -1.5151 5.3606
quadrupole: 7.3594 -1.0199 -6.3395 2.6060 -1.5151 5.3606
hfenergy: -731.6246763 hartree
pointgroup: C01 [X(C14H24N2O1)]
dipole: 0.6975398 -0.9511342 0.1254676 debye
polarizability: 240.6591066|-6.3328686|166.2898543|-6.4836684|-14.7227317|123.0095264 unknown
InChI: InChI=1S/C14H24N2O/c1-10(2)15-8-14(17)9-16-13-6-11(3)5-12(4)7-13/h5-7,10,14-17H,8-9H2,1-4H3
charge 0 multiplicity 1
41 atoms
O  0.861314 1.775952 0.582752
N  3.411011 -1.0240 0.436113
N  -0.18994 -0.88883 -0.345461
C  1.702637 0.755835 -0.068525
C  2.459512 -0.051053 1.018008
C  0.883007 -0.14729 -1.021444
C  4.747187 -0.506285 0.026834
C  -1.546089 -0.51474 -0.304162
C  5.439297 -1.559158 -0.863622
C  5.654471 -0.106085 1.223037
C  -1.991145 0.783812 -0.679038
C  -2.509704 -1.46771 0.14469
C  -3.366987 1.118584 -0.618472
C  -3.878045 -1.140139 0.224855
C  -4.301479 0.160322 -0.161645
C  -3.826092 2.500931 -1.055188
C  -4.891047 -2.160612 0.718906
H  2.418499 1.344287 -0.672077
H  1.706229 -0.606506 1.611215
H  2.931053 0.685723 1.70669
H  0.45672 0.46913 -1.834441
H  1.589755 -0.870149 -1.469028
H  4.563759 0.398786 -0.585468
H  3.511919 -1.867867 1.016353
H  0.016852 -1.855386 -0.095159
H  6.419758 -1.194903 -1.220669
H  5.614935 -2.49468 -0.296537
H  4.808747 -1.801902 -1.736391
H  5.146729 0.612256 1.892306
H  6.59137 0.365103 0.87151
H  5.925679 -1.000192 1.817622
H  -1.272212 1.540712 -1.009907
H  -2.176254 -2.474244 0.432951
H  0.077706 1.316348 0.984645
H  -5.364979 0.423807 -0.1030
H  -4.817016 2.748218 -0.63595
H  -3.907577 2.562882 -2.15808
H  -3.113353 3.283071 -0.736916
H  -4.41705 -3.133484 0.936859
H  -5.388113 -1.812939 1.644531
H  -5.686062 -2.331805 -0.031101
