program: Gaussian 09
title: 000209598
version: EM64L-G09RevD.01
frameworkgroup: C1[X(C20H28N2O)]
method: RPBEPBE
basis: SDD
operation: Freq
keyword: #p
keyword: freq=noraman
keyword: PBEPBE/SDD
title: #p freq=noraman PBEPBE/SDD
converged: YES YES NO NO
title: Mulliken charges:
elementType: O N N C C C C C C C C C C C C C C C C C C C C H H H H H H H H H H H H H H H H H H H H H H H H H H H H
charge: -0.478153 -0.219682 -0.309798 -0.388330 -0.048614 -0.421650 -0.500806 -0.509341 -0.047261 0.488724 0.488594 -0.686126 -0.703263 -0.375819 -0.350130 -0.445825 -0.453511 -0.240286 -0.235637 -0.225413 -0.224577 -0.237561 -0.240509 0.234930 0.224337 0.171311 0.214850 0.219963 0.228923 0.206582 0.244060 0.202371 0.234145 0.207209 0.374820 0.234052 0.210742 0.199032 0.206671 0.196619 0.234536 0.254647 0.237795 0.233101 0.232530 0.227929 0.227047 0.225630 0.224783 0.228732 0.227624
chargesum: 0.00000
title: Mulliken charges with hydrogens summed into heavy atoms:
elementType: O N N C C C C C C C C C C C C C C C C C C C C
charge: -0.103334 -0.219682 -0.075653 0.070937 0.122697 0.013164 -0.065301 -0.062910 0.159948 0.488724 0.488594 -0.042300 -0.065438 -0.121172 -0.112335 -0.212724 -0.220980 -0.012356 -0.008590 0.000217 0.000207 -0.008829 -0.012885
polarizability: 2.58788657e+02 2.39360519e+01 2.09697295e+02 -9.42690649e+00 4.55164079e+00 2.16676681e+02
1716.lowfreq: -7.9614 -0.0006 -0.0001 0.0004 3.6534 5.1145 13.7825 15.6420 25.4378
frequency: 13.5093 15.5372 25.3789 30.8900 36.2437 39.7676 54.3960 63.0268 98.1459 117.2280 122.4282 124.0820 160.0529 197.7550 206.4155 220.9891 238.7664 254.7119 298.1888 313.1902 335.2214 343.1652 349.5879 396.5263 404.3702 405.8380 406.8303 427.0131 453.0110 474.1848 498.0299 510.3928 560.0255 608.5893 612.1798 616.4668 619.0413 672.6424 697.7991 706.4283 721.0270 740.2998 757.2525 812.9619 820.5668 823.9828 829.8710 853.1824 858.2136 860.9942 906.7790 911.4883 920.0345 924.7049 932.6991 938.6680 965.0372 973.1748 981.2222 982.2881 990.4119 990.8097 998.2720 999.7146 1022.6007 1026.0704 1031.6518 1050.0598 1071.1972 1078.0064 1082.1608 1090.6605 1108.6905 1113.3961 1129.5213 1170.8542 1171.6515 1172.4222 1180.4529 1184.8570 1188.7385 1214.1061 1217.0068 1219.6609 1232.1343 1242.7070 1245.7885 1280.2068 1297.9780 1312.3969 1320.8453 1327.4727 1328.6314 1342.4318 1356.9062 1361.2147 1364.8369 1373.1541 1385.0441 1387.6250 1389.0922 1422.4001 1439.6963 1441.0751 1443.8244 1457.8235 1462.5920 1463.8024 1471.9372 1473.8164 1478.6856 1483.4561 1484.3219 1485.3428 1485.7555 1594.2025 1594.7809 1613.8975 1614.7514 2889.4703 2892.7104 2900.8845 2911.2928 2964.6152 2966.9006 2972.2275 2977.9251 3012.9823 3026.1773 3030.8084 3059.3444 3059.9936 3070.0831 3072.7181 3093.0073 3114.1652 3114.3597 3118.5006 3124.0542 3132.1331 3134.9813 3144.5185 3146.4786 3162.4507 3162.8105 3181.1370 3407.1228
redmass: 4.5366 4.1127 4.6630 3.4532 3.1429 3.7420 3.9758 4.5836 4.1417 3.5915 3.6873 3.6707 4.1153 3.8182 1.0371 2.3205 2.6887 1.2638 3.1933 3.2147 2.3841 2.8983 2.6922 2.9007 2.8396 2.8211 2.8332 2.6126 2.1012 3.1184 3.3455 2.8926 3.5936 4.1040 4.4653 6.2395 5.0143 1.5675 1.5250 2.0387 1.3045 1.7307 1.8051 3.0671 3.5262 2.3629 3.2963 2.7846 1.2482 1.2508 1.7800 1.2935 1.3874 1.4450 1.5366 1.5969 1.9747 1.9188 1.3903 1.4263 5.0926 5.8754 1.3322 1.3430 2.2710 2.1966 2.0204 3.3913 2.6571 1.8287 1.6924 1.6085 2.4488 2.3075 2.1698 1.7959 1.1113 1.0711 1.8996 1.1099 1.1286 2.4736 2.3166 1.4725 1.4406 1.4482 1.3451 1.2128 1.1745 1.3613 1.3035 1.2761 1.2074 1.2918 1.4282 1.3736 1.6069 1.2663 7.4581 1.2303 4.0029 1.5255 2.1443 2.0957 1.1726 1.1055 1.0555 1.0484 1.1449 1.2067 1.0696 1.0842 2.0708 1.5294 1.2556 6.0604 6.1159 6.0651 6.1591 1.0821 1.0708 1.0703 1.0684 1.0646 1.0361 1.0485 1.0725 1.0886 1.0924 1.0889 1.0970 1.0987 1.0974 1.0994 1.1000 1.0873 1.0871 1.0875 1.0861 1.0908 1.0912 1.0957 1.0962 1.1014 1.1015 1.0636 1.0733
irintensity: 0.2130 0.0666 0.0010 0.2324 0.1084 0.3487 1.4886 1.2331 2.0639 1.6397 1.1412 2.4160 0.6542 2.4667 0.2275 1.9201 0.6634 1.4305 3.5215 4.3564 0.4150 2.6847 3.6917 1.7276 3.3013 0.5490 0.3811 0.9956 3.1911 9.1986 16.0136 8.4030 1.8804 4.4199 6.1938 0.2504 2.1674 82.0559 106.4483 35.1130 51.4797 60.3183 84.1196 9.7625 11.0569 3.9250 12.4489 2.3051 1.1146 0.4791 2.9830 8.2198 4.5660 6.1204 5.8487 2.1732 19.9891 21.4280 0.7382 0.5831 0.2028 0.6533 1.7698 1.5996 35.4433 6.3943 10.4519 64.4276 11.8783 1.6649 24.6452 3.7799 5.7143 49.7177 19.7785 14.1135 2.7093 1.6806 57.8710 0.8564 0.5757 0.9909 5.3479 9.8789 17.2176 14.1767 11.2735 7.1717 13.2227 1.0018 5.3148 2.0760 14.0420 4.0965 8.7820 6.3068 3.5982 28.3681 0.9208 27.5921 3.4169 52.6871 4.2690 13.8826 28.7672 10.6815 3.5343 3.8205 12.1083 5.9036 7.3509 3.9536 7.5884 29.4021 1.3080 0.8083 0.9317 2.4749 3.2977 76.2174 37.5041 108.1771 54.8694 50.1745 32.2085 17.9064 32.2956 9.6754 27.0494 12.8019 20.6273 6.8636 91.7391 39.3764 40.1243 6.8275 8.4048 1.7702 1.1221 7.9680 16.0210 35.1891 42.4570 31.4453 20.1475 223.5216 2.1785
temp: 298.150 k
press: 1.00000 atm
elementType: 8 7 7 6 6 6 6 6 6 6 6 6 6 6 6 6 6 6 6 6 6 6 6 1 1 1 1 1 1 1 1 1 1 1 1 1 1 1 1 1 1 1 1 1 1 1 1 1 1 1 1
symmnumber: 1
zpe: 1148713.8 jmol-1
zpe.correction: 0.437522 hartree
zpe.thermalcorrener: 0.461016 hartree
zpe.thermalcorrenthalpy: 0.461960 hartree
zpe.thermalcorrgfe: 0.380087 hartree
zpe.sumelectzpe: -961.884730 hartree
zpe.sumelectthermal: -961.861236 hartree
zpe.sumelectthermalent: -961.860292 hartree
zpe.sumelectthermalfe: -961.942165 hartree
dipole: 0.1161 -0.0886 -2.2216
dipole: 2.2264
quadrupole: -127.8009 -135.2596 -137.0269
quadrupole: 1.4628 -1.2750 2.4266
quadrupole: 5.5616 -1.8972 -3.6644 1.4628 -1.2750 2.4266
hfenergy: -962.3222519 hartree
pointgroup: C01 [X(C20H28N2O1)]
dipole: -0.0972455 -0.1310647 -0.8605915 debye
polarizability: 263.8865833|19.179959|203.4001215|2.2587392|-4.1678521|217.8759281 unknown
InChI: InChI=1S/C20H28N2O/c1-17(2)21-13-20(23)16-22(14-18-9-5-3-6-10-18)15-19-11-7-4-8-12-19/h3-12,17,20-21,23H,13-16H2,1-2H3
charge 0 multiplicity 1
51 atoms
O  -0.495221 1.213381 1.57596
N  0.478374 0.142427 -0.644889
N  -3.687195 1.807355 -0.300431
C  -0.99064 0.410249 -0.682765
C  -1.33296 1.473658 0.401423
C  -2.808641 1.432442 0.832142
C  1.275536 1.198678 -1.342519
C  0.856699 -1.230796 -1.086677
C  -5.130848 1.477946 -0.158302
C  2.729808 1.237523 -0.890179
C  0.365385 -2.322713 -0.145602
C  -5.833655 2.190818 1.031259
C  -5.843969 1.789098 -1.490046
C  3.047756 1.572147 0.452483
C  0.712187 -2.296762 1.229792
C  3.784668 0.961735 -1.794066
C  -0.419903 -3.396856 -0.630727
C  4.391937 1.624114 0.879695
C  0.2850 -3.323387 2.098508
C  5.133382 1.013286 -1.36937
C  -0.84883 -4.42942 0.236119
C  5.44004 1.343723 -0.030279
C  -0.497731 -4.394565 1.604444
H  -1.504954 -0.532221 -0.424696
H  -1.352642 0.735882 -1.680183
H  -1.106497 2.494124 0.009762
H  -3.05798 0.400068 1.144164
H  -2.91731 2.077662 1.734376
H  0.793793 2.166715 -1.112431
H  1.225709 1.066655 -2.449405
H  1.962532 -1.25193 -1.131433
H  0.486642 -1.43408 -2.120222
H  -3.563221 2.79755 -0.562353
H  -5.183297 0.383712 0.016966
H  0.251344 0.651131 1.185197
H  -5.323246 1.976352 1.987799
H  -6.884548 1.858401 1.12637
H  -5.835581 3.288106 0.879944
H  -6.909827 1.500988 -1.445444
H  -5.798297 2.873115 -1.715319
H  -5.361679 1.244885 -2.320354
H  2.237147 1.799923 1.155889
H  1.322055 -1.470559 1.613492
H  3.550214 0.707382 -2.835707
H  -0.697696 -3.425286 -1.692049
H  4.624682 1.888424 1.917523
H  0.560042 -3.290163 3.158768
H  5.939319 0.796055 -2.07947
H  -1.456281 -5.253914 -0.154167
H  6.483552 1.385388 0.301755
H  -0.830057 -5.19135 2.279453
