program: Gaussian 09
title: 000209582
version: EM64L-G09RevD.01
frameworkgroup: C1[X(C14H24N2O)]
method: RPBEPBE
basis: SDD
operation: Freq
keyword: #p
keyword: freq=noraman
keyword: PBEPBE/SDD
title: #p freq=noraman PBEPBE/SDD
converged: YES YES NO NO
title: Mulliken charges:
elementType: O N N C C C C C C C C C C C C C C H H H H H H H H H H H H H H H H H H H H H H H H
charge: -0.443581 -0.300084 -0.434828 -0.044389 -0.448528 -0.483663 -0.066090 0.288591 -0.698423 -0.680640 0.288352 -0.546871 0.476494 -0.384995 -0.466981 -0.853192 -0.822614 0.229526 0.201643 0.240431 0.247190 0.234123 0.212396 0.232993 0.301101 0.208939 0.194630 0.238308 0.231186 0.214566 0.197717 0.269878 0.352724 0.221045 0.228565 0.222122 0.241144 0.221560 0.230338 0.220236 0.229081
chargesum: 0.00000
title: Mulliken charges with hydrogens summed into heavy atoms:
elementType: O N N C C C C C C C C C C C C C C
charge: -0.090857 -0.067091 -0.133727 0.185137 -0.006453 -0.002350 0.146306 0.288591 -0.056545 -0.037171 0.288352 -0.276992 0.476494 -0.163950 -0.238416 -0.168366 -0.142960
polarizability: 2.30686916e+02 -7.45697184e+00 1.73318904e+02 1.42392760e+01 4.99558381e+00 1.19491020e+02
1716.lowfreq: -14.3842 -5.7420 -0.0006 -0.0004 0.0005 5.3674 7.7060 22.6080 30.4154
frequency: 7.3783 22.5623 30.2423 42.2695 49.0273 78.7586 84.2693 123.6832 152.7015 180.8602 196.0849 203.9237 209.6840 224.2231 254.9952 266.8118 292.5786 308.4440 314.6912 335.4950 387.4122 397.0200 414.2641 433.3341 446.3209 455.2016 462.9843 486.1375 499.3605 552.8555 589.8934 636.3006 647.1671 709.9635 724.4157 754.8863 788.6376 801.9902 828.0564 878.6562 904.2567 908.4187 913.9775 926.8783 933.2186 936.4000 973.7211 986.4692 1006.3211 1028.8496 1040.5992 1046.9001 1072.0101 1094.2483 1126.4850 1133.0517 1137.6584 1158.2227 1173.7218 1181.3103 1196.6179 1215.5518 1243.6804 1261.9487 1286.8456 1306.2545 1310.5073 1316.4206 1331.1720 1344.2823 1359.6530 1365.3318 1373.5764 1377.0931 1388.8813 1390.8607 1394.6127 1429.9602 1439.8705 1453.8025 1462.5588 1463.9574 1466.7897 1470.2379 1472.0398 1475.4768 1476.5813 1480.6387 1484.1110 1487.9275 1526.8343 1592.7980 1626.3077 2890.2036 2941.8089 2965.3448 2972.2190 2973.1304 2982.0742 2987.9091 3005.9889 3042.7703 3049.6074 3052.6643 3059.1707 3061.2354 3070.0082 3071.6110 3081.0837 3082.7906 3096.0579 3112.6852 3139.9521 3144.5947 3422.2406 3525.6040 3579.6163
redmass: 3.8080 2.9742 3.6011 1.1397 2.9811 3.6517 4.1217 2.9051 3.4415 3.4714 1.1686 2.2007 1.0617 2.6480 1.1775 2.7237 2.6792 2.8546 3.3109 2.9371 1.8400 1.4563 2.1711 1.5296 2.1762 3.5752 1.7988 3.0766 2.6415 4.0202 3.7367 2.4316 1.7691 4.9291 3.2994 3.8894 3.2491 1.2550 2.3925 1.3401 2.5845 1.8273 1.3286 2.1017 1.3462 1.5652 1.7969 1.7268 1.4530 2.4221 1.5117 1.5456 2.1702 3.1223 2.2859 1.9347 1.7192 1.5942 2.0401 3.0344 1.5031 1.6841 1.5917 1.2646 1.7119 1.4539 1.7258 1.3650 1.2334 1.3254 1.2652 1.3957 1.6510 2.1399 1.2284 1.2737 1.2313 2.4206 1.3037 1.4579 1.0528 1.0548 1.0980 1.0753 1.0796 1.0463 1.2021 1.0746 1.0517 1.2250 2.2589 5.0079 6.1831 1.0698 1.0399 1.0357 1.0433 1.0379 1.0789 1.0604 1.0974 1.0872 1.1021 1.0959 1.0984 1.0894 1.0970 1.0993 1.0944 1.0993 1.1001 1.0875 1.0926 1.0941 1.0739 1.0655 1.0758
irintensity: 0.1022 0.6225 0.0200 0.3416 0.8150 0.8864 0.5224 1.0793 1.2267 0.6041 1.5775 2.7996 0.2967 2.1898 0.3498 1.7653 0.8082 2.6046 2.9782 2.9139 3.6868 15.2588 1.0266 174.5150 16.0257 16.2850 98.1100 7.1535 63.5936 2.7526 7.3048 38.0102 58.4316 1.0994 1.3664 1.5090 6.7058 41.2135 11.4294 7.7053 5.8358 0.8869 5.3990 6.9217 0.2989 0.1127 77.8835 29.4469 2.9458 17.2951 1.4495 19.7588 6.1791 23.9912 15.5949 8.4503 13.1034 28.3874 78.2165 22.4964 16.8818 7.2506 8.2663 8.4867 17.2748 1.0370 59.3585 11.4523 1.2146 18.2941 13.9763 16.1876 9.2680 26.0282 29.3481 17.1154 6.6137 91.8515 14.2117 4.8213 3.3271 3.3302 17.5210 24.2866 4.0873 19.9859 22.4055 10.8207 15.5118 40.1330 130.2398 81.5673 98.9000 68.2181 50.5190 25.2216 23.1431 39.2937 25.0418 39.2090 30.7200 11.5612 22.5158 22.7528 8.9631 49.0771 90.8543 52.7392 15.2343 24.6747 34.6560 17.6262 30.1731 5.3984 4.0124 12.4426 16.7036
temp: 298.150 k
press: 1.00000 atm
elementType: 8 7 7 6 6 6 6 6 6 6 6 6 6 6 6 6 6 1 1 1 1 1 1 1 1 1 1 1 1 1 1 1 1 1 1 1 1 1 1 1 1
symmnumber: 1
zpe: 936316.0 jmol-1
zpe.correction: 0.356624 hartree
zpe.thermalcorrener: 0.376678 hartree
zpe.thermalcorrenthalpy: 0.377622 hartree
zpe.thermalcorrgfe: 0.305088 hartree
zpe.sumelectzpe: -731.265722 hartree
zpe.sumelectthermal: -731.245668 hartree
zpe.sumelectthermalent: -731.244724 hartree
zpe.sumelectthermalfe: -731.317258 hartree
dipole: -2.0120 2.6611 -0.6320
dipole: 3.3954
quadrupole: -100.2036 -104.8497 -108.0350
quadrupole: -3.4932 0.2591 1.9584
quadrupole: 4.1592 -0.4869 -3.6723 -3.4932 0.2591 1.9584
hfenergy: -731.622346 hartree
pointgroup: C01 [X(C14H24N2O1)]
dipole: 0.7246113 -0.6681268 0.9017001 debye
polarizability: 229.7354181|-16.8933878|125.336321|4.5547241|-17.8017367|168.4251007 unknown
InChI: InChI=1S/C14H24N2O/c1-10(2)15-8-13(17)9-16-14-7-11(3)5-6-12(14)4/h5-7,10,13,15-17H,8-9H2,1-4H3
charge 0 multiplicity 1
41 atoms
O  0.47931 1.540027 -1.558269
N  3.413972 -0.386477 -0.14585
N  -0.280764 -0.826679 0.123434
C  1.366062 0.377365 -1.371279
C  2.413754 0.69609 -0.278437
C  0.54394 -0.906138 -1.091463
C  4.787845 0.010207 0.266146
C  -1.658304 -0.525644 0.157884
C  5.715476 -1.216272 0.149831
C  4.86476 0.640093 1.684649
C  -2.387228 -0.767844 1.37186
C  -2.336379 0.019288 -0.968355
C  -3.721563 0.311185 -0.92563
C  -3.762341 -0.456235 1.399024
C  -4.435168 0.073567 0.273148
C  -1.689467 -1.343668 2.591779
C  -4.41979 0.865557 -2.157014
H  1.886353 0.25898 -2.337671
H  1.877582 0.939482 0.670402
H  2.93617 1.618323 -0.591685
H  -0.104076 -1.111324 -1.963084
H  1.247179 -1.757223 -1.005849
H  5.12289 0.770292 -0.468565
H  3.074809 -1.170258 0.429859
H  0.106031 -1.244476 0.967748
H  6.758298 -0.947381 0.396596
H  5.400787 -2.015369 0.8504
H  5.68499 -1.625333 -0.874563
H  4.183847 1.506205 1.774664
H  5.889813 0.990154 1.90958
H  4.58202 -0.103126 2.455895
H  -1.780893 0.236067 -1.88686
H  -0.114687 1.603952 -0.764643
H  -4.321509 -0.635523 2.326095
H  -5.504947 0.30418 0.329444
H  -0.869006 -0.689893 2.954606
H  -2.399694 -1.463942 3.42681
H  -1.252444 -2.344061 2.3900
H  -4.588772 0.072728 -2.911545
H  -5.403919 1.295766 -1.902091
H  -3.817038 1.653756 -2.643996
