program: Gaussian 09
title: 000209583
version: EM64L-G09RevD.01
frameworkgroup: C1[X(C14H24N2O)]
method: RPBEPBE
basis: SDD
operation: Freq
keyword: #p
keyword: freq=noraman
keyword: PBEPBE/SDD
title: #p freq=noraman PBEPBE/SDD
converged: YES YES NO NO
title: Mulliken charges:
elementType: O N N C C C C C C C C C C C C C C H H H H H H H H H H H H H H H H H H H H H H H H
charge: -0.445591 -0.290054 -0.404496 -0.039072 -0.453646 -0.503496 -0.061757 0.085970 0.350293 0.330696 -0.700355 -0.684433 -0.406909 -0.424892 -0.838071 -0.881054 -0.260466 0.223226 0.199202 0.242365 0.258033 0.231313 0.212639 0.232984 0.294159 0.209727 0.194542 0.239078 0.231883 0.216140 0.196237 0.351594 0.227974 0.226491 0.229341 0.226282 0.254833 0.235344 0.227045 0.243451 0.223450
chargesum: 0.00000
title: Mulliken charges with hydrogens summed into heavy atoms:
elementType: O N N C C C C C C C C C C C C C C
charge: -0.093998 -0.057071 -0.110337 0.184155 -0.012079 -0.014150 0.150882 0.085970 0.350293 0.330696 -0.057008 -0.040174 -0.178935 -0.198401 -0.127616 -0.175213 -0.037016
polarizability: 2.08887847e+02 1.46725145e+00 1.78263719e+02 2.26190087e+01 9.08885279e+00 1.26365981e+02
1716.lowfreq: -15.2627 -7.0543 -0.0009 -0.0007 -0.0005 7.1148 20.8647 32.0300 41.2232
frequency: 20.2811 31.8757 41.1875 57.8584 88.8823 92.0765 125.9948 172.3716 198.3340 209.7316 212.9232 223.1595 237.6465 253.2920 267.0521 273.4707 296.3721 308.6419 319.4704 338.3079 384.8205 400.2910 418.6644 448.3785 451.6871 459.6285 497.6027 503.3931 517.6746 544.2808 559.5099 639.3420 647.4259 656.8375 736.9525 767.8297 771.7670 804.2827 831.1996 895.3717 897.5773 910.8742 916.6875 930.7513 938.0601 957.8614 978.5629 986.4057 1006.8645 1028.8778 1041.1300 1052.6899 1079.2059 1091.3496 1110.2343 1125.3291 1132.4315 1154.5343 1172.6164 1174.3482 1205.1506 1238.1940 1247.1783 1250.8258 1277.9048 1294.6238 1304.9067 1314.6094 1329.3571 1350.3535 1361.8973 1364.0125 1368.2875 1378.7426 1389.5935 1393.9150 1397.2062 1429.8450 1436.2958 1452.9418 1460.8353 1462.2398 1465.6766 1471.6379 1473.3611 1479.6637 1481.5516 1483.4309 1485.7193 1501.4074 1506.9321 1596.4453 1607.0863 2882.4526 2944.4076 2964.6768 2968.7864 2973.0571 2982.6810 3009.2163 3013.3873 3037.8472 3050.1697 3053.5125 3058.7657 3069.7863 3071.7074 3077.4225 3080.2976 3083.1131 3095.7236 3116.5321 3122.7305 3158.3831 3410.5555 3515.7897 3535.8783
redmass: 4.3257 2.9314 3.0723 4.2398 3.7921 3.8975 3.5051 3.2690 1.9041 1.0939 1.3563 2.0945 3.0776 1.1839 2.0106 1.3570 2.0474 2.8812 2.6659 3.1628 2.2306 1.1734 2.2005 1.7023 1.9907 3.8941 2.6844 3.1530 3.5059 3.3300 3.6158 2.4934 2.0919 2.4099 4.2095 1.2412 3.8332 3.3592 2.4732 2.5962 1.3290 1.3918 1.6308 2.6449 1.4862 1.3341 1.5619 1.5769 2.8504 1.7771 1.5190 1.5162 2.2030 2.6757 1.9217 2.4674 2.2765 1.7316 1.1780 2.0208 1.4172 2.9103 1.8561 1.5609 1.4677 1.9435 1.4581 1.3800 1.2301 1.3002 1.4895 2.4124 1.2538 1.3354 1.2337 1.2917 1.2528 1.6560 1.2758 1.8577 1.2057 1.0707 1.0626 1.0766 1.0634 1.1166 1.0885 1.3495 1.0837 1.1485 1.2678 4.8889 5.7192 1.0696 1.0401 1.0360 1.0372 1.0430 1.0789 1.0968 1.0640 1.0855 1.0975 1.0892 1.0983 1.0973 1.0991 1.0996 1.0945 1.0978 1.1001 1.0862 1.0916 1.0987 1.0734 1.0660 1.0749
irintensity: 0.1122 0.0738 0.4116 0.1074 0.9409 0.3597 2.0484 0.1501 1.8479 0.1905 0.3096 0.9586 16.4679 0.1256 2.6491 0.3540 1.6850 4.3318 1.5202 14.3337 0.6941 131.5344 3.8118 57.0438 15.6235 14.3737 33.1953 4.9818 28.2785 7.5541 27.1107 18.3452 41.3470 46.8325 5.7461 53.0041 10.8318 2.7095 15.3356 2.8796 0.1280 4.5371 1.7221 13.3880 0.5806 0.5783 35.7095 8.5082 34.7087 1.2872 7.1206 5.1810 2.1646 31.9426 18.3507 16.2129 16.4599 23.1808 0.6732 67.2140 17.9836 13.7388 6.3552 2.3749 20.0773 35.6303 27.2588 4.3496 1.4272 13.8386 26.0465 2.7907 14.4108 5.9294 28.9185 11.1981 16.7835 47.7504 15.4260 7.2319 23.5656 0.1854 14.2177 0.8223 13.3467 49.3208 5.4705 72.3737 32.7758 6.6591 31.5472 0.9863 26.7795 77.4749 42.8002 22.3620 29.7457 21.1734 24.8787 31.8053 32.6919 14.8716 11.0689 66.4162 12.7740 69.6067 72.6895 33.4875 14.8691 9.5116 31.5544 2.5538 30.4775 30.2785 7.5584 18.8629 7.4680
temp: 298.150 k
press: 1.00000 atm
elementType: 8 7 7 6 6 6 6 6 6 6 6 6 6 6 6 6 6 1 1 1 1 1 1 1 1 1 1 1 1 1 1 1 1 1 1 1 1 1 1 1 1
symmnumber: 1
zpe: 938655.6 jmol-1
zpe.correction: 0.357515 hartree
zpe.thermalcorrener: 0.376846 hartree
zpe.thermalcorrenthalpy: 0.377790 hartree
zpe.thermalcorrgfe: 0.309596 hartree
zpe.sumelectzpe: -731.256748 hartree
zpe.sumelectthermal: -731.237417 hartree
zpe.sumelectthermalent: -731.236473 hartree
zpe.sumelectthermalfe: -731.304667 hartree
dipole: -1.9665 1.9632 -1.4079
dipole: 3.1150
quadrupole: -102.0985 -105.6285 -108.6183
quadrupole: -3.4980 2.4046 4.0570
quadrupole: 3.3499 -0.1801 -3.1698 -3.4980 2.4046 4.0570
hfenergy: -731.6142629 hartree
pointgroup: C01 [X(C14H24N2O1)]
dipole: 0.6507519 -0.2696684 1.0028724 debye
polarizability: 209.4666053|-20.3152732|132.6100861|9.4483948|18.9153503|171.4408562 unknown
InChI: InChI=1S/C14H24N2O/c1-10(2)15-8-13(17)9-16-14-11(3)6-5-7-12(14)4/h5-7,10,13,15-17H,8-9H2,1-4H3
charge 0 multiplicity 1
41 atoms
O  0.181269 0.847243 -2.36026
N  3.029656 -0.110625 -0.058511
N  -0.260104 -1.403894 -0.154615
C  1.201967 -0.039396 -1.766772
C  1.932348 0.702872 -0.624852
C  0.599208 -1.412291 -1.358463
C  4.125029 0.626808 0.630343
C  -1.443925 -0.644545 0.045842
C  -2.482198 -0.550434 -0.942267
C  -1.631041 -0.023987 1.332297
C  5.242349 -0.372206 0.99187
C  3.660268 1.428544 1.877664
C  -3.628199 0.230305 -0.649764
C  -2.804092 0.721441 1.582826
C  -2.432179 -1.312111 -2.255673
C  -0.583776 -0.172131 2.4247
C  -3.799164 0.874817 0.593275
H  1.915733 -0.218469 -2.590563
H  1.17322 1.036088 0.124535
H  2.369774 1.621009 -1.057873
H  0.056291 -1.809021 -2.230817
H  1.432915 -2.110406 -1.156117
H  4.526975 1.345934 -0.112244
H  2.681897 -0.877061 0.536667
H  0.251456 -1.590352 0.708893
H  6.102784 0.146043 1.451947
H  4.87687 -1.124836 1.718811
H  5.588269 -0.904791 0.089441
H  2.84339 2.127668 1.621448
H  4.492676 2.021026 2.301404
H  3.295026 0.742931 2.66777
H  -0.519166 1.031573 -1.680133
H  -4.412834 0.30463 -1.412856
H  -2.931015 1.193226 2.564891
H  -2.136735 -2.365561 -2.0929
H  -3.426959 -1.309612 -2.733239
H  -1.715312 -0.8662 -2.971619
H  0.416404 0.182238 2.100734
H  -0.470285 -1.224316 2.759852
H  -0.866987 0.415747 3.313725
H  -4.6984 1.466305 0.794103
