program: Gaussian 09
title: 000209617
version: EM64L-G09RevD.01
frameworkgroup: C1[X(C21H22N2O2S)]
method: RPBEPBE
basis: SDD
operation: Freq
keyword: #p
keyword: freq=noraman
keyword: PBEPBE/SDD
title: #p freq=noraman PBEPBE/SDD
converged: YES YES NO NO
title: Mulliken charges:
elementType: S O O N N C C C C C C C C C C C C C C C C C C C C C H H H H H H H H H H H H H H H H H H H H H H
charge: 0.243099 -0.448945 -0.448734 -0.094322 -0.147207 -0.129370 -0.461810 -0.402663 -0.509728 -0.444185 -0.111455 0.330051 0.308314 -0.272264 -0.145491 0.105118 0.113732 -0.324748 -0.343441 -0.524004 -0.391196 -0.396822 -0.257381 -0.269092 -0.209864 -0.211540 0.252415 0.249295 0.231377 0.208090 0.235175 0.252055 0.225895 0.228547 0.234898 0.259912 0.237657 0.251047 0.275002 0.256461 0.216739 0.212816 0.228356 0.225672 0.226877 0.224103 0.358323 0.353236
chargesum: 0.00000
title: Mulliken charges with hydrogens summed into heavy atoms:
elementType: S O O N N C C C C C C C C C C C C C C C C C C C C C
charge: 0.243099 -0.090622 -0.095498 -0.094322 -0.147207 0.123045 0.018862 0.040602 -0.031778 0.019260 -0.111455 0.330051 0.308314 -0.012351 0.092166 0.105118 0.113732 -0.073702 -0.068439 -0.267543 -0.174457 -0.184006 -0.029025 -0.043419 0.017012 0.012563
polarizability: 3.08977241e+02 1.33027383e+01 2.80476742e+02 -1.04246219e+01 1.03011403e+01 1.72158528e+02
1716.lowfreq: -8.4617 -4.2512 -0.0022 -0.0019 -0.0010 5.8645 13.8626 17.3849 25.3781
frequency: 13.7929 17.0531 25.2957 27.2768 30.3557 41.6582 60.2428 90.9302 97.5793 124.5747 146.4262 158.2364 166.1853 205.8510 243.5962 250.1350 255.1796 271.8805 285.0340 305.0424 331.4987 358.1926 367.4436 385.4481 415.9709 437.2458 441.0668 458.0291 464.0878 481.2359 515.3742 523.0857 538.1920 540.7166 561.8090 585.4746 593.1902 605.3813 657.2165 683.8905 687.4231 695.0479 705.4349 714.4766 750.3614 754.6872 756.3648 770.3664 777.0638 788.5956 820.3001 825.4481 831.0240 840.1997 842.2738 845.8648 866.6184 879.6521 907.7717 915.0372 937.9275 939.6262 967.3102 970.5865 980.7461 994.2143 1004.2699 1031.0178 1035.5612 1039.0095 1058.6521 1062.5939 1072.7681 1080.5950 1082.2035 1123.1107 1141.6543 1146.6580 1150.6361 1166.3250 1169.3310 1170.6108 1185.8638 1195.5958 1203.8791 1210.8076 1213.7026 1236.2583 1239.5893 1245.5241 1250.8627 1275.2023 1296.4825 1301.4358 1306.9194 1311.5457 1328.7156 1329.9414 1359.6028 1363.2570 1396.7793 1400.6988 1436.5026 1439.2495 1447.7741 1461.7488 1475.2963 1478.7320 1488.9152 1494.0076 1495.3813 1551.3812 1602.0435 1604.1357 1615.7262 1616.2006 2895.8198 2935.2009 2962.5267 2994.9426 3007.8183 3016.1322 3016.4040 3030.9131 3094.6723 3106.5413 3112.7122 3133.0874 3134.4370 3147.6087 3149.5753 3164.7826 3164.8547 3166.1629 3191.6890 3230.9559 3578.9808 3584.0503
redmass: 5.6605 5.5670 5.4833 5.9648 5.4402 5.5360 4.0430 4.2724 4.1736 5.3712 3.4368 4.7175 3.8088 6.1746 4.1932 4.7866 3.7935 3.4237 3.2962 2.6789 3.1721 1.1384 1.1397 3.4335 3.4633 3.1284 3.1287 5.0166 4.3973 3.8154 7.0757 5.7732 3.5970 3.9209 3.1285 5.7427 5.6917 8.8411 3.3300 5.9572 5.0050 1.2093 2.5912 3.2845 3.6623 1.4126 1.5390 3.6785 4.1438 3.4280 3.5182 2.9299 3.2640 2.0486 1.4158 1.4212 3.2214 2.9699 1.4177 2.3574 1.4524 1.4409 1.8034 1.8156 1.4762 1.4705 2.3518 1.6466 2.0878 2.1119 2.9660 2.9935 2.2915 1.4041 1.9036 1.9690 2.2181 1.2549 1.2673 1.0725 2.8538 1.1115 1.2978 1.5429 1.9618 1.3713 1.8101 2.3582 2.3597 1.3515 1.4673 1.4750 1.4398 1.3671 1.3738 1.2911 1.4518 2.0877 1.5650 1.5888 4.4562 4.3231 2.1343 2.2970 1.1495 1.0890 6.7629 1.1687 2.3415 2.2250 1.1466 6.3170 6.5467 6.4711 6.7186 6.7194 1.0684 1.0688 1.0593 1.0859 1.0883 1.0727 1.0998 1.0835 1.1054 1.0885 1.0881 1.0875 1.0872 1.0935 1.0929 1.0993 1.0904 1.1004 1.0966 1.1000 1.0658 1.0660
irintensity: 0.0662 0.0155 0.3568 0.2850 0.1973 0.2660 0.1331 0.8819 2.1943 0.7143 3.1598 0.2547 2.1573 1.9394 0.1963 4.6623 8.9436 6.9933 3.2327 0.0835 16.4431 45.8854 206.2428 1.9486 4.1044 5.4683 2.1046 9.0325 15.9772 25.4634 4.8308 5.4137 2.0078 1.3785 0.4993 1.7117 2.3080 0.9737 2.3679 1.9555 13.4870 94.9805 12.3109 0.8977 18.5397 83.2161 82.4308 22.2171 13.7002 23.2511 4.5561 25.4229 5.9297 9.8255 2.0347 4.2399 19.9596 23.1597 2.2803 1.6586 1.6425 4.1281 4.4576 12.1680 7.9678 10.5971 51.4705 5.8646 14.7404 3.7235 48.0488 50.7133 40.8941 30.7804 56.3219 11.9194 28.3261 47.1288 62.9741 4.1124 26.9153 4.0735 9.6164 15.1598 29.8645 13.3600 23.4139 8.5977 32.3077 54.7070 12.2856 42.8968 66.5343 9.3568 30.8967 3.9758 0.7089 4.5865 3.3219 4.6760 8.9575 8.2230 19.9475 37.1579 28.0513 13.2645 6.8890 17.0603 21.2244 15.6179 9.5062 0.7805 16.0692 30.8190 4.7668 3.4994 37.0132 49.7862 41.3034 8.3761 21.2007 11.7624 19.1896 61.7555 30.4200 16.6405 12.4565 8.8530 3.4874 22.1706 13.8281 26.0734 12.5331 21.2247 4.2585 3.6498 21.7611 27.1673
temp: 298.150 k
press: 1.00000 atm
elementType: 16 8 8 7 7 6 6 6 6 6 6 6 6 6 6 6 6 6 6 6 6 6 6 6 6 6 1 1 1 1 1 1 1 1 1 1 1 1 1 1 1 1 1 1 1 1 1 1
symmnumber: 1
zpe: 1003307.5 jmol-1
zpe.correction: 0.382140 hartree
zpe.thermalcorrener: 0.405829 hartree
zpe.thermalcorrenthalpy: 0.406774 hartree
zpe.thermalcorrgfe: 0.325026 hartree
zpe.sumelectzpe: -1469.511365 hartree
zpe.sumelectthermal: -1469.487675 hartree
zpe.sumelectthermalent: -1469.486731 hartree
zpe.sumelectthermalfe: -1469.568479 hartree
dipole: 0.1555 -3.3782 -0.3223
dipole: 3.3971
quadrupole: -145.0659 -138.1726 -157.5732
quadrupole: 5.9867 -2.9029 8.9594
quadrupole: 1.8713 8.7647 -10.6360 5.9867 -2.9029 8.9594
hfenergy: -1469.8935049 hartree
pointgroup: C01 [X(C21H22N2O2S1)]
dipole: -0.1576716 0.9165942 -0.9598333 debye
polarizability: 307.871385|6.2742321|221.9945883|-13.4813484|-56.3077484|231.7465377 unknown
InChI: InChI=1S/C21H22N2O2S/c24-18-8-3-1-6-16(18)14-22-11-12-23(21(22)20-10-5-13-26-20)15-17-7-2-4-9-19(17)25/h1-10,13,21,24-25H,11-12,14-15H2
charge 0 multiplicity 1
48 atoms
S  0.956531 -2.860602 1.269911
O  -1.88853 2.439115 -1.893494
O  2.650865 1.783573 -2.939199
N  -1.122114 0.611049 1.654122
N  0.992698 0.100519 0.599441
C  -0.424226 -0.383056 0.779223
C  -0.019835 1.027164 2.577663
C  1.264898 1.089365 1.686249
C  -1.671135 1.764719 0.865009
C  1.400137 0.518935 -0.757764
C  -0.46571 -1.755193 1.425207
C  -2.867425 1.34706 0.023398
C  2.900701 0.372527 -0.999338
C  -1.508404 -2.377064 2.093878
C  -1.216476 -3.732208 2.500195
C  -2.962013 1.701435 -1.347831
C  3.505685 1.022417 -2.107175
C  -3.931768 0.604966 0.589482
C  3.727967 -0.410529 -0.163199
C  0.052573 -4.152165 2.134314
C  -4.083117 1.328949 -2.12839
C  4.889932 0.904424 -2.368189
C  -5.05853 0.22707 -0.173228
C  5.11381 -0.544378 -0.411679
C  -5.131645 0.591444 -1.537809
C  5.696417 0.117729 -1.515208
H  -0.936064 -0.421458 -0.201979
H  0.09402 0.251004 3.354348
H  -0.256204 1.98639 3.066012
H  1.409992 2.104423 1.255319
H  2.172746 0.833869 2.262245
H  -0.913693 2.243432 0.210711
H  -1.989858 2.522823 1.606644
H  1.105975 1.570832 -0.985121
H  0.862176 -0.110734 -1.493476
H  -2.449885 -1.861597 2.294348
H  -1.921188 -4.36538 3.046076
H  -3.846863 0.317461 1.643225
H  3.253146 -0.919164 0.682299
H  0.537144 -5.11051 2.314574
H  -4.136923 1.613273 -3.187775
H  5.33486 1.418492 -3.231166
H  -5.869022 -0.346741 0.287948
H  5.731832 -1.159866 0.25063
H  -5.998595 0.303965 -2.142721
H  6.769313 0.024934 -1.716669
H  -2.012146 2.574256 -2.865319
H  3.170652 2.214232 -3.662437
