program: Gaussian 09
title: 000209746
version: EM64L-G09RevD.01
frameworkgroup: C1[X(C19H20N2O3)]
method: RPBEPBE
basis: SDD
operation: Freq
keyword: #p
keyword: freq=noraman
keyword: PBEPBE/SDD
title: #p freq=noraman PBEPBE/SDD
converged: NO YES NO NO
title: Mulliken charges:
elementType: O O O N N C C C C C C C C C C C C C C C C C C C H H H H H H H H H H H H H H H H H H H H
charge: -0.289010 -0.287597 -0.289037 -0.472376 -0.420066 0.312479 0.095374 -0.589083 0.309505 -0.353882 -0.407600 -0.365591 -0.235324 -0.252642 -0.516238 0.549794 0.287567 -0.588379 -0.415370 0.224048 0.213256 -0.325416 -0.502669 -0.535885 0.237314 0.236818 0.290909 0.241441 0.206453 0.290371 0.266445 0.227932 0.224474 0.223711 0.284673 0.257930 0.248126 0.238428 0.248353 0.215660 0.224888 0.241875 0.224555 0.223789
chargesum: 0.00000
title: Mulliken charges with hydrogens summed into heavy atoms:
elementType: O O O N N C C C C C C C C C C C C C C C C C C C
charge: -0.289010 -0.287597 -0.289037 -0.182005 -0.135393 0.312479 0.095374 -0.114951 0.309505 -0.062973 -0.166159 -0.159138 -0.010850 -0.028931 -0.021861 0.549794 0.287567 -0.330449 -0.167244 0.224048 0.213256 -0.086988 0.186232 0.154333
polarizability: 3.44784006e+02 7.57849210e+00 1.96863987e+02 2.32887337e+01 -1.56418882e+01 1.84598760e+02
1716.lowfreq: -4.4391 -0.0010 -0.0005 0.0006 2.6743 3.8486 13.2628 15.6295 20.5972
frequency: 8.1446 15.3400 20.5777 41.6677 55.8391 66.5447 71.7126 97.5116 120.5189 140.1083 156.5554 160.7678 187.0733 203.1797 206.0638 229.1006 238.5604 243.8639 278.5480 283.2551 312.4626 331.7398 363.4697 387.7377 412.6990 422.9589 446.2517 457.7795 467.9025 480.1927 527.4277 542.9627 570.7751 585.9541 610.1912 620.1130 627.3386 683.0311 705.2977 705.8035 711.0838 718.1100 726.5879 742.5585 767.3375 798.3696 805.3514 809.0367 832.8308 850.6157 876.3414 887.4973 917.3148 922.5112 930.4987 949.6208 978.2861 981.0279 985.0173 998.9865 1021.2392 1029.1798 1057.3363 1096.4785 1107.7007 1108.6048 1110.3282 1112.9761 1139.3078 1145.5787 1154.2635 1169.1226 1176.7626 1194.6474 1203.3090 1204.4338 1209.9263 1235.6175 1254.7209 1257.9291 1280.3983 1293.1798 1323.8129 1344.4754 1382.7607 1399.3757 1407.5190 1422.8284 1434.8076 1446.7820 1447.0843 1454.3546 1459.4637 1465.5131 1469.5166 1473.1251 1475.6961 1488.7782 1498.5157 1510.7966 1583.6812 1588.4024 1616.6585 1618.4115 1623.3848 1643.8271 2959.3035 2970.2027 2983.3697 2986.8366 3008.6255 3045.7109 3047.4255 3094.1274 3101.0550 3121.5595 3123.2955 3124.2892 3137.3973 3139.2462 3141.6075 3159.2231 3163.5213 3236.9147 3535.7346 3547.3352
redmass: 4.3239 4.9405 4.9350 2.7102 5.2082 4.3688 5.6701 4.3518 2.7071 2.0280 5.2953 2.9751 2.6983 4.1001 3.9944 2.6954 3.8727 1.2540 1.9500 4.4779 3.7269 3.5635 3.1792 1.6500 2.7895 3.3359 4.1717 4.4062 3.6517 3.2045 4.1294 6.5985 1.2835 5.7372 4.2337 3.7837 4.8184 5.4017 8.8231 5.7960 5.6123 1.7287 3.5680 4.5441 2.0173 1.6082 1.2888 3.7538 4.4612 1.3377 3.8715 1.6435 1.6118 2.2374 1.7087 1.7086 1.3301 3.1413 2.9698 3.5404 2.2155 2.4341 4.6490 2.5315 1.3795 1.1387 1.2576 1.9565 1.9193 1.4778 1.4616 1.1405 1.5307 2.1149 1.8498 1.9758 1.6012 1.2837 2.5331 1.9132 2.1180 1.6445 2.4973 1.6356 5.6845 4.1473 2.0400 1.2165 1.1853 2.3045 1.4076 1.0611 2.4890 1.0506 1.0513 1.1815 1.0847 1.8084 2.4368 2.5428 7.3771 6.4854 6.5106 7.1068 5.4656 5.7105 1.0327 1.0607 1.0636 1.0319 1.0982 1.0980 1.1040 1.1004 1.0883 1.0995 1.0873 1.1051 1.0931 1.0882 1.0910 1.0998 1.0951 1.0963 1.0769 1.0769
irintensity: 0.4270 0.6315 0.7055 7.2614 2.9108 6.1504 5.6793 8.1316 1.4710 0.3485 1.1389 0.5281 0.6010 0.2215 2.6946 6.0757 2.9726 0.6641 9.9989 22.0646 2.2161 3.8282 4.4994 26.4276 3.5632 11.8267 0.0731 9.9827 3.1595 2.4171 1.6408 0.2425 204.0609 11.7671 8.6863 1.1631 14.3642 0.1261 5.8469 9.4289 11.7071 44.1741 3.0011 4.4256 58.1127 34.2258 52.5168 7.0162 0.9359 0.0492 12.4327 22.0271 4.3472 3.9463 1.1728 0.4493 0.1649 36.5409 34.9751 56.8179 8.6761 25.4522 6.5842 8.6097 9.7032 1.3647 0.1238 63.6769 1.8660 6.4891 13.0946 0.3992 21.0532 34.1765 182.0910 70.7494 64.9370 139.9233 307.1631 18.2457 41.6104 1.7120 18.0928 35.8647 50.7413 4.1000 66.1897 17.3385 1.2371 15.4739 56.2957 14.4076 70.2714 14.0207 32.2144 153.9053 4.4538 204.1374 199.4444 587.8257 37.9235 58.8166 22.6447 2.2170 51.0000 193.1906 64.0557 28.3849 51.6262 86.9269 11.6713 9.1875 45.0281 42.4808 26.6737 25.5716 1.0512 23.7645 31.5452 6.0004 7.3801 33.5313 9.9006 2.1600 12.0084 19.4149
temp: 298.150 k
press: 1.00000 atm
elementType: 8 8 8 7 7 6 6 6 6 6 6 6 6 6 6 6 6 6 6 6 6 6 6 6 1 1 1 1 1 1 1 1 1 1 1 1 1 1 1 1 1 1 1 1
symmnumber: 1
zpe: 921396.1 jmol-1
zpe.correction: 0.350941 hartree
zpe.thermalcorrener: 0.373718 hartree
zpe.thermalcorrenthalpy: 0.374663 hartree
zpe.thermalcorrgfe: 0.294924 hartree
zpe.sumelectzpe: -1069.447996 hartree
zpe.sumelectthermal: -1069.425219 hartree
zpe.sumelectthermalent: -1069.424274 hartree
zpe.sumelectthermalfe: -1069.504013 hartree
dipole: -1.8549 3.8243 -0.3499
dipole: 4.2647
quadrupole: -115.8700 -139.1687 -136.0428
quadrupole: -4.5726 -8.6517 4.7731
quadrupole: 14.4905 -8.8082 -5.6823 -4.5726 -8.6517 4.7731
hfenergy: -1069.7989371 hartree
pointgroup: C01 [X(C19H20N2O3)]
dipole: 0.7465508 -1.103374 1.0200517 debye
polarizability: 342.4525722|-15.6223659|205.8868866|-27.2744899|-7.3138611|177.9072948 unknown
InChI: InChI=1S/C19H20N2O3/c1-23-17-10-7-13(11-18(17)24-2)12-20-19(22)21-16-9-8-14-5-3-4-6-15(14)16/h3-7,9-11,20-21H,8,12H2,1-2H3
charge 0 multiplicity 1
44 atoms
O  6.018238 -0.782203 -1.615334
O  -0.998386 2.223421 -1.008748
O  6.017706 -0.672811 1.291109
N  -2.053859 0.151623 -0.634819
N  0.151493 0.226689 -1.432829
C  -5.522527 0.443621 0.565882
C  -4.379556 -0.317095 0.177713
C  -5.195987 1.922593 0.429307
C  -3.310997 0.630078 -0.211461
C  -3.761965 1.925109 -0.076744
C  -6.695831 -0.201475 0.989626
C  -4.406104 -1.729789 0.214768
C  -6.726675 -1.620595 1.027426
C  -5.591353 -2.375396 0.643705
C  1.400628 0.894203 -1.834131
C  2.598417 0.477264 -0.985715
C  -0.966926 0.956126 -1.02585
C  3.791088 0.035803 -1.601063
C  2.555817 0.555774 0.426497
C  4.932865 -0.32949 -0.850838
C  4.872618 -0.262506 0.576481
C  3.680968 0.190511 1.194797
C  7.403235 -0.616598 -1.13437
C  5.95931 -0.615118 2.753117
H  -5.883644 2.432478 -0.276508
H  -5.295225 2.456135 1.396821
H  -3.177996 2.819262 -0.285529
H  -7.577042 0.377303 1.290176
H  -3.537434 -2.336296 -0.074251
H  -1.938656 -0.862772 -0.655673
H  1.200703 1.977516 -1.73613
H  1.612074 0.696972 -2.903494
H  -7.634483 -2.138048 1.357342
H  -5.631243 -3.469939 0.680841
H  0.14167 -0.79455 -1.427227
H  3.872578 -0.032138 -2.691894
H  1.646477 0.910135 0.923924
H  3.624917 0.258111 2.285366
H  7.616126 -1.281218 -0.282611
H  7.598032 0.431251 -0.840154
H  8.024727 -0.885011 -2.002813
H  6.938667 -0.982915 3.093612
H  5.157502 -1.267858 3.149962
H  5.805431 0.421349 3.111613
