program: Gaussian 09
title: 000209640
version: EM64L-G09RevD.01
frameworkgroup: C1[X(C18H29N3O)]
method: RPBEPBE
basis: SDD
operation: Freq
keyword: #p
keyword: freq=noraman
keyword: PBEPBE/SDD
title: #p freq=noraman PBEPBE/SDD
converged: YES YES NO NO
title: Mulliken charges:
elementType: O N N N C C C C C C C C C C C C C C C C C C H H H H H H H H H H H H H H H H H H H H H H H H H H H H H
charge: -0.313025 -0.084357 -0.308661 -0.404646 -0.146889 -0.392138 -0.500322 -0.364181 0.019011 -0.721290 -0.722524 0.291593 0.261171 -0.336930 -0.350931 -0.395461 -0.333756 -0.223614 -0.219736 -0.235350 -0.350429 -0.687548 0.303671 0.240014 0.188118 0.236906 0.235875 0.180683 0.222994 0.169335 0.206607 0.223899 0.227914 0.224493 0.207272 0.226150 0.318166 0.256618 0.261981 0.255073 0.200036 0.189972 0.222707 0.232259 0.232472 0.233174 0.188288 0.199911 0.209143 0.213144 0.213136
chargesum: 0.00000
title: Mulliken charges with hydrogens summed into heavy atoms:
elementType: O N N N C C C C C C C C C C C C C C C C C C
charge: -0.313025 -0.084357 -0.308661 -0.086479 0.156783 0.035994 -0.027542 0.039496 0.188346 -0.062870 -0.064609 0.291593 0.261171 -0.080312 -0.088949 0.059648 0.078923 0.008645 0.012736 -0.002176 0.037769 -0.052125
polarizability: 2.29763623e+02 -8.17682403e+00 2.22863379e+02 -1.93366515e+00 6.52522067e+00 1.98886786e+02
1716.lowfreq: -10.6544 -5.3154 0.0002 0.0005 0.0008 1.3958 6.2452 21.6608 25.9414
frequency: -6.5062 20.8685 25.8005 35.2053 45.9585 56.1387 65.6459 77.8137 86.5976 93.6928 99.2550 126.6427 149.4786 167.0995 197.6417 217.0410 231.2701 237.9617 247.4049 255.3971 289.3544 295.9636 305.3019 340.8420 371.4977 407.3095 411.9935 428.0590 455.6816 465.9218 483.8330 499.4552 520.0031 532.1917 575.1286 614.5583 641.6475 672.7679 703.1096 709.1328 734.1486 756.0609 776.3444 804.0236 826.8687 834.1207 845.7565 855.4768 884.0903 897.6249 919.5256 928.8890 933.1118 948.1501 969.4458 975.0518 979.9876 985.1453 992.0908 998.1217 999.7004 1022.7709 1027.1829 1050.1257 1071.7857 1080.0873 1082.2728 1098.0809 1114.9202 1119.0612 1134.4863 1163.6364 1167.5438 1168.3922 1171.5623 1177.0799 1177.7442 1195.2296 1211.6575 1226.4636 1233.7382 1253.2746 1258.3956 1271.8041 1279.1323 1288.4075 1303.2592 1307.4773 1314.7057 1319.5478 1325.2256 1335.9007 1349.3647 1360.7169 1367.5099 1368.1784 1374.2084 1378.8916 1388.0224 1390.0050 1432.5618 1446.5091 1459.5818 1460.8630 1471.7723 1473.7623 1474.3417 1477.2125 1477.4778 1479.4130 1481.3116 1486.4464 1492.5484 1493.7869 1497.8645 1583.1096 1599.4976 1609.9526 2795.8554 2837.3854 2856.8359 2957.9429 2972.4644 2973.6319 2982.0152 2985.2595 2990.3181 3003.4920 3016.6531 3036.8868 3043.2722 3053.2583 3063.2387 3069.4668 3071.4766 3075.0835 3078.8235 3082.8457 3083.6312 3085.2875 3087.8419 3128.0249 3135.3842 3148.7416 3156.1408 3168.7453 3562.1601
redmass: 3.6975 3.5430 3.7369 2.7375 4.0096 4.0188 2.1712 2.7980 5.6442 2.4649 2.2781 2.8122 3.4227 2.2976 1.4232 2.5414 1.7008 1.4138 1.7616 2.9221 2.3422 2.5401 3.0960 3.5009 2.6587 3.5058 2.9071 3.7011 2.6260 2.6656 2.3464 1.8027 2.0737 2.8206 3.0479 6.5210 4.9981 4.2667 6.4313 1.7827 1.4312 2.1935 1.9281 3.3853 1.6602 1.7055 1.9190 1.2400 2.5712 2.0799 1.1574 1.4776 1.8190 1.4269 1.6427 1.4711 1.3794 3.4324 4.3177 1.3513 2.4207 2.0645 2.3553 2.7651 1.5566 2.3933 2.4684 3.0479 2.3968 2.3576 1.9718 2.1873 2.1088 2.1488 1.0567 1.2819 1.4730 1.3646 1.8685 1.3593 1.5155 1.4247 1.8757 1.9976 1.4419 1.1049 1.3800 1.3435 1.2562 1.3655 1.4347 1.4678 1.4743 1.4159 7.1525 1.3624 1.2492 1.5487 1.2126 1.2104 2.1921 1.1273 1.0800 1.0527 1.0488 1.0699 1.0669 1.1252 1.0434 2.0297 1.1244 1.0832 1.7910 1.0516 1.1002 6.2052 6.4034 6.9087 1.0806 1.0698 1.0717 1.0587 1.0422 1.0556 1.0350 1.0356 1.0661 1.0974 1.0608 1.0886 1.1000 1.0857 1.0916 1.1002 1.0996 1.0995 1.0993 1.1000 1.1011 1.0987 1.0995 1.0849 1.0884 1.0928 1.0967 1.1016 1.0770
irintensity: 0.1514 0.2569 0.0743 0.0961 0.1210 2.1619 0.4191 1.0592 5.1308 0.2134 0.9495 0.2401 1.7118 0.3354 0.2934 1.6001 3.9091 1.7512 0.1410 0.9522 4.8686 4.5161 4.3625 0.7707 1.1398 14.4567 1.9582 1.6145 0.2871 5.7269 14.7916 46.1230 33.3523 7.7897 7.7772 0.2077 8.3026 7.8718 10.0769 81.4588 21.0530 3.0493 12.0760 3.9056 1.4186 4.0399 0.3983 0.2700 10.2695 1.0256 2.6874 0.2931 2.2565 0.2712 8.8938 3.5907 0.2466 0.8494 1.2863 0.1302 0.5747 8.6063 13.7508 5.5664 12.9000 3.9634 32.7903 5.5254 0.6813 8.6420 3.9711 19.2758 5.6525 13.1905 0.0133 1.1049 39.8055 10.7562 30.6796 12.6813 42.8993 40.8521 49.9326 323.5736 7.6571 0.4533 2.9590 5.9211 45.4358 32.2919 7.7173 6.8306 2.4999 14.8871 1.0278 7.7582 19.3053 29.0913 9.2069 26.3950 5.0776 31.0593 4.9222 6.5900 3.2715 11.4430 5.4292 15.3234 11.0265 29.4510 11.9915 26.5111 414.0660 10.2437 9.4584 4.3060 124.2461 160.4558 77.2783 93.0279 120.1465 26.6343 19.9154 67.6225 28.9504 27.5246 49.4233 6.7122 28.2389 37.9778 51.7251 16.8983 14.5084 76.1891 46.4028 18.3491 11.7372 29.6657 40.4062 58.4853 48.6108 1.3343 4.0682 22.4330 21.1930 11.4871 12.9812
temp: 298.150 k
press: 1.00000 atm
elementType: 8 7 7 7 6 6 6 6 6 6 6 6 6 6 6 6 6 6 6 6 6 6 1 1 1 1 1 1 1 1 1 1 1 1 1 1 1 1 1 1 1 1 1 1 1 1 1 1 1 1 1
symmnumber: 1
zpe: 1162366.0 jmol-1
zpe.correction: 0.442722 hartree
zpe.thermalcorrener: 0.465712 hartree
zpe.thermalcorrenthalpy: 0.466656 hartree
zpe.thermalcorrgfe: 0.388321 hartree
zpe.sumelectzpe: -941.088431 hartree
zpe.sumelectthermal: -941.065441 hartree
zpe.sumelectthermalent: -941.064497 hartree
zpe.sumelectthermalfe: -941.142832 hartree
dipole: -0.9450 4.4184 2.4019
dipole: 5.1171
quadrupole: -126.6223 -133.6349 -133.1678
quadrupole: -2.2023 0.3298 -6.2318
quadrupole: 4.5193 -2.4933 -2.0261 -2.2023 0.3298 -6.2318
hfenergy: -941.5311531 hartree
pointgroup: C01 [X(C18H29N3O1)]
dipole: 0.2127943 1.9865865 0.2473822 debye
polarizability: 228.3967157|8.1863807|222.1815512|2.9805224|9.6211245|200.9355209 unknown
InChI: InChI=1S/C18H29N3O/c1-4-5-12-19-18(22)21(16-9-7-6-8-10-16)17-11-13-20(14-17)15(2)3/h6-10,15,17,19H,4-5,11-14H2,1-3H3
charge 0 multiplicity 1
51 atoms
O  1.206584 -2.443395 0.424342
N  -3.318915 -0.953888 -0.415575
N  0.182175 -0.339285 0.70056
N  2.545617 -0.568516 0.790739
C  -1.159872 -0.949191 0.535426
C  -1.943056 -0.490583 -0.718895
C  -2.16142 -0.694446 1.704847
C  -3.554262 -0.596845 1.019238
C  -4.377402 -0.481853 -1.347642
C  -5.748061 -1.070113 -0.945661
C  -4.042279 -0.87186 -2.803583
C  0.325226 1.077642 0.941988
C  1.312738 -1.191546 0.625913
C  0.385638 1.99029 -0.143714
C  0.424221 1.569385 2.27016
C  3.799036 -1.330931 0.669994
C  4.394125 -1.328883 -0.758985
C  0.529749 3.37546 0.097478
C  0.569363 2.9550 2.508844
C  0.619458 3.860949 1.423398
C  4.826094 0.068531 -1.256716
C  5.41875 0.037006 -2.682257
H  -0.963557 -2.029799 0.441129
H  -1.549877 -0.961392 -1.634774
H  -1.887076 0.623242 -0.837001
H  -2.11137 -1.511912 2.443386
H  -1.923191 0.247522 2.228419
H  -3.956706 0.443906 1.112791
H  -4.293113 -1.282048 1.468868
H  -4.452656 0.640098 -1.294117
H  -6.525191 -0.747647 -1.66214
H  -5.699247 -2.174409 -0.950749
H  -6.062769 -0.741547 0.060429
H  -3.126232 -0.375188 -3.168822
H  -4.871252 -0.580302 -3.473586
H  -3.898974 -1.965415 -2.877089
H  2.585087 0.442419 0.920586
H  0.331032 1.603345 -1.166857
H  0.393681 0.856914 3.101831
H  3.576196 -2.368226 0.973701
H  4.53178 -0.909636 1.386178
H  5.271386 -2.008674 -0.768871
H  3.647108 -1.76359 -1.451262
H  0.575019 4.073014 -0.746232
H  0.642993 3.325636 3.537264
H  0.730389 4.934996 1.608833
H  5.573198 0.493496 -0.554066
H  3.951754 0.751122 -1.239331
H  6.312028 -0.614444 -2.725788
H  5.719257 1.046014 -3.020142
H  4.682089 -0.358329 -3.406685
