program: Gaussian 09
title: 000209566
version: EM64L-G09RevD.01
frameworkgroup: C1[X(C8H18NO)]
method: RPBEPBE
basis: SDD
operation: Freq
keyword: #p
keyword: freq=noraman
keyword: PBEPBE/SDD
title: #p freq=noraman PBEPBE/SDD
converged: YES YES NO NO
title: Mulliken charges:
elementType: O N C C C C C C C C H H H H H H H H H H H H H H H H H H
charge: -0.476249 -0.079457 -0.346485 -0.358893 -0.444344 -0.439500 -0.308821 -0.397819 -0.602457 -0.341580 0.262903 0.260924 0.329811 0.240724 0.259477 0.235374 0.236892 0.260102 0.275545 0.263884 0.259881 0.214353 0.270459 0.297559 0.259594 0.247677 0.227310 0.393137
chargesum: 1.00000
title: Mulliken charges with hydrogens summed into heavy atoms:
elementType: O N C C C C C C C C
charge: -0.083112 -0.079457 0.177342 0.211642 0.050507 0.057495 0.230608 0.076414 0.225155 0.133407
polarizability: 1.04544752e+02 8.19693576e-01 8.78723253e+01 -3.56393464e-01 3.68931615e-01 7.82595597e+01
1716.lowfreq: -15.1710 -0.0009 -0.0004 0.0007 12.6004 24.7148 71.6641 137.4031 151.2011
frequency: 71.5817 137.3627 151.1365 217.5498 246.5518 272.2911 296.7530 319.2514 331.1698 347.8993 392.7932 415.2489 427.5120 463.6772 509.0819 579.4578 671.2776 762.5532 814.2326 828.4267 835.9753 861.9747 899.4992 930.6953 943.4756 970.0081 981.6860 1006.4835 1050.6709 1062.8645 1082.4954 1114.4032 1118.9120 1160.9404 1176.0567 1180.6682 1195.3460 1217.9387 1244.7577 1265.3998 1280.8851 1297.1872 1323.3822 1339.1567 1347.9644 1353.1169 1362.4266 1374.1447 1397.5434 1420.0207 1434.8957 1450.1860 1461.4735 1465.4888 1467.4813 1469.6784 1481.2624 1486.3794 1491.2930 1504.1233 2976.5374 2993.5751 3004.4415 3005.8730 3012.7898 3020.5703 3021.9205 3031.5520 3032.3964 3059.6914 3061.3618 3076.2200 3087.8291 3102.5851 3118.2205 3142.1079 3164.7749 3591.7738
redmass: 3.7554 2.5378 3.6159 1.5668 2.4119 2.3574 1.4828 2.4697 1.3639 1.4587 2.3490 1.9973 2.3875 2.9993 2.0032 1.9507 3.1858 1.6877 2.9387 2.0469 1.7753 2.0116 2.7285 1.5922 2.1344 1.9764 2.1353 2.2231 2.1794 2.7144 1.8707 1.8190 1.1809 1.9664 1.3730 1.5584 1.2150 1.3477 1.3014 1.2589 1.1555 1.1878 1.3397 1.2707 1.3134 1.4364 1.3962 1.3486 1.3119 1.3080 1.2396 1.0894 1.0617 1.0726 1.0815 1.0911 1.0783 1.0875 1.0639 1.0564 1.0573 1.0677 1.0634 1.0618 1.0602 1.0693 1.0831 1.0629 1.0488 1.0996 1.0969 1.1009 1.1071 1.1060 1.1032 1.1048 1.1024 1.0671
irintensity: 3.4942 0.0932 5.1799 0.0642 5.9527 6.3476 6.6348 3.1209 109.9715 55.7894 2.2495 0.0606 7.5086 0.2313 6.4910 3.9905 1.2345 1.3372 15.1932 3.2802 3.1455 37.1154 27.7835 25.2013 7.1362 7.3521 12.7659 12.9078 15.5077 46.7871 1.4586 0.5844 2.0188 1.5068 7.9672 2.1541 12.9688 2.9517 6.0728 5.0186 3.4082 11.4089 9.9523 1.4401 0.4039 0.4609 2.3222 6.5355 1.6523 7.6481 14.3182 6.4131 17.0221 13.4873 28.6075 19.7901 39.2941 17.1717 11.4243 18.6373 32.2958 13.2437 14.1176 15.1114 7.9833 12.2962 4.1681 14.0411 16.0049 7.2355 16.5421 20.7902 16.4070 9.4441 8.0411 3.7046 2.9542 32.3937
temp: 298.150 k
press: 1.00000 atm
elementType: 8 7 6 6 6 6 6 6 6 6 1 1 1 1 1 1 1 1 1 1 1 1 1 1 1 1 1 1
symmnumber: 1
zpe: 677495.3 jmol-1
zpe.correction: 0.258044 hartree
zpe.thermalcorrener: 0.268711 hartree
zpe.thermalcorrenthalpy: 0.269655 hartree
zpe.thermalcorrgfe: 0.222987 hartree
zpe.sumelectzpe: -444.532481 hartree
zpe.sumelectthermal: -444.521815 hartree
zpe.sumelectthermalent: -444.520871 hartree
zpe.sumelectthermalfe: -444.567539 hartree
dipole: -1.9424 -1.8933 0.1669
dipole: 2.7176
quadrupole: -34.6326 -52.9597 -55.1105
quadrupole: 0.5000 -0.5967 0.6136
quadrupole: 12.9350 -5.3921 -7.5429 0.5000 -0.5967 0.6136
hfenergy: -444.7905255 hartree
pointgroup: C01 [X(C8H18N1O1)]
dipole: 0.80373 0.664535 0.2357623 debye
polarizability: 104.0715038|-0.7562521|87.8432915|3.5541587|0.459387|78.7618419 unknown
InChI: InChI=1S/C8H18NO/c1-9(7-8-10)5-3-2-4-6-9/h10H,2-8H2,1H3
charge 1 multiplicity 1
28 atoms
O  2.586935 -1.414415 0.254027
N  0.135468 0.262855 0.159137
C  -0.87716 1.344325 -0.307315
C  -0.27942 -1.108293 -0.457322
C  -2.341409 0.978017 -0.015768
C  -1.729843 -1.487574 -0.129583
C  1.527308 0.676928 -0.383228
C  -2.722215 -0.401039 -0.600451
C  0.162542 0.182777 1.678925
C  2.737441 0.040528 0.305777
H  -0.713638 1.454166 -1.394717
H  -0.585533 2.285925 0.190654
H  0.465686 -1.836906 -0.104838
H  -0.156705 -0.9850 -1.549008
H  -2.96587 1.772921 -0.463597
H  -2.545479 1.009347 1.070827
H  -1.855338 -1.695743 0.949531
H  -1.933035 -2.443864 -0.645827
H  1.523815 0.427403 -1.457187
H  1.600428 1.773782 -0.272739
H  -3.750543 -0.66505 -0.300103
H  -2.71691 -0.350661 -1.707438
H  -0.853487 0.010482 2.055255
H  0.812218 -0.652914 1.975918
H  0.543961 1.134044 2.08236
H  3.62903 0.384473 -0.257093
H  2.842129 0.392573 1.351572
H  3.439121 -1.866891 0.471932
