program: Gaussian 09
title: 000209564
version: EM64L-G09RevD.01
frameworkgroup: C1[X(C13H19N3O)]
method: RPBEPBE
basis: SDD
operation: Freq
keyword: #p
keyword: freq=noraman
keyword: PBEPBE/SDD
title: #p freq=noraman PBEPBE/SDD
converged: YES YES NO NO
title: Mulliken charges:
elementType: O N N N C C C C C C C C C C C C C H H H H H H H H H H H H H H H H H H H
charge: -0.323099 -0.033872 -0.308795 -0.414254 -0.064278 -0.494371 -0.477015 -0.437184 -0.633063 0.311228 0.284459 -0.353396 -0.346936 -0.219796 -0.220840 -0.235193 -0.612628 0.282357 0.228742 0.237877 0.219747 0.246303 0.222422 0.223406 0.222224 0.229291 0.205104 0.259752 0.261071 0.323425 0.233260 0.232978 0.233877 0.219466 0.219320 0.278411
chargesum: 0.00000
title: Mulliken charges with hydrogens summed into heavy atoms:
elementType: O N N N C C C C C C C C C C C C C
charge: -0.323099 -0.033872 -0.308795 -0.090829 0.218079 -0.027752 -0.010965 0.008645 0.023556 0.311228 0.284459 -0.093644 -0.085865 0.013463 0.012138 -0.001316 0.104569
polarizability: 1.56222130e+02 -2.94850879e+00 1.83955071e+02 -4.22696999e+00 -1.07091457e+00 1.35846942e+02
1716.lowfreq: -18.7388 -10.1215 -0.0005 0.0004 0.0006 3.0234 20.1686 34.1197 41.4090
frequency: 17.2076 33.9894 41.2942 68.0318 75.7980 99.3916 106.2235 133.6368 152.0549 188.4663 210.2884 251.7524 278.7574 288.0995 312.0363 357.6216 396.0475 403.6984 413.4948 463.1338 476.3903 520.7947 544.3179 608.6034 614.5453 646.7384 668.9469 701.8939 711.2177 744.9745 779.5965 794.2203 854.7246 856.1576 866.6809 918.3328 930.5048 937.3435 958.0708 981.0425 989.1149 999.3151 999.5576 1021.9097 1034.3949 1044.4073 1070.4911 1072.9842 1088.0355 1120.2638 1126.6163 1136.2252 1153.5812 1171.9234 1172.1418 1177.4601 1180.7459 1225.7864 1251.5935 1262.7719 1281.7759 1290.8934 1299.7885 1304.9191 1313.5747 1327.5065 1366.8897 1387.5764 1419.2353 1427.8000 1432.5754 1461.9256 1462.4024 1462.6849 1469.8146 1472.6551 1480.2852 1483.9270 1488.1104 1519.9580 1582.4662 1600.4803 1612.7037 2875.3372 2969.5049 2983.2339 2995.5544 3012.3440 3023.7466 3039.6624 3043.3945 3069.0683 3073.5438 3080.5722 3085.3627 3107.4975 3128.3793 3135.5937 3148.6973 3156.8870 3169.1618 3562.3388
redmass: 3.2523 3.3733 3.8599 2.5434 4.0802 3.1814 1.4276 3.5411 3.3372 2.3100 1.0939 3.7667 3.5599 4.1348 3.9917 2.0917 5.2533 2.1828 2.8987 5.0091 3.2016 1.1594 2.7248 3.8277 6.2274 4.6142 4.4028 10.5133 1.7761 3.2448 2.1413 3.5530 2.7081 1.2376 2.2734 1.9972 1.4236 2.6117 2.3185 1.3727 6.0442 2.3003 1.3640 2.1466 2.7048 2.6486 2.0859 1.5785 2.1391 1.4418 1.2754 1.5496 1.5927 1.6220 1.4403 1.4637 1.2442 1.7112 1.9977 2.8286 1.8113 1.2393 1.3029 1.3780 1.2585 1.4337 7.6769 1.4577 1.1834 1.1581 2.1680 1.0959 1.1416 1.2113 1.0716 1.1026 2.3111 1.0548 1.0456 1.4735 6.1871 6.2937 6.8921 1.0540 1.0357 1.0660 1.0654 1.0604 1.0752 1.0848 1.1025 1.0994 1.0998 1.1000 1.1040 1.0969 1.0849 1.0884 1.0930 1.0965 1.1015 1.0769
irintensity: 0.0805 0.2173 0.2586 5.9364 0.0740 0.5476 1.3177 4.4244 3.5301 1.2300 0.0427 0.2762 1.8579 9.6285 4.2116 7.6231 17.8763 3.5479 0.3292 2.0298 8.7784 83.2076 15.8590 3.1057 1.6472 30.0987 1.5685 12.9631 66.5698 1.2985 25.7196 2.7327 6.6828 0.6526 7.0703 1.5252 0.3786 6.1318 1.9764 0.2424 1.0166 12.3019 1.1180 5.1725 16.0613 6.6398 25.4926 10.1446 6.2921 10.2283 0.0257 43.1990 38.5151 0.5040 0.5514 14.2682 3.4769 17.2359 16.6847 340.0928 13.2193 0.3362 4.6480 1.7473 2.1274 9.7620 0.9190 5.5072 35.4199 2.2198 4.9674 28.3203 90.5781 96.7982 14.4310 6.5647 52.1302 6.6930 14.2355 206.5810 4.1866 95.7049 206.8037 86.9589 110.9999 58.9814 46.3214 12.2414 60.0074 11.7993 42.7527 9.9439 14.8852 51.7080 42.0472 2.1229 1.3396 3.8523 21.1635 20.4680 11.2742 14.9741
temp: 298.150 k
press: 1.00000 atm
elementType: 8 7 7 7 6 6 6 6 6 6 6 6 6 6 6 6 6 1 1 1 1 1 1 1 1 1 1 1 1 1 1 1 1 1 1 1
symmnumber: 1
zpe: 797402.4 jmol-1
zpe.correction: 0.303715 hartree
zpe.thermalcorrener: 0.320709 hartree
zpe.thermalcorrenthalpy: 0.321653 hartree
zpe.thermalcorrgfe: 0.257052 hartree
zpe.sumelectzpe: -744.961690 hartree
zpe.sumelectthermal: -744.944696 hartree
zpe.sumelectthermalent: -744.943752 hartree
zpe.sumelectthermalfe: -745.008353 hartree
dipole: 0.9468 5.0062 0.9819
dipole: 5.1887
quadrupole: -102.2695 -105.0783 -96.9612
quadrupole: 4.7343 -4.4171 -2.0437
quadrupole: -0.8332 -3.6420 4.4752 4.7343 -4.4171 -2.0437
hfenergy: -745.2654048 hartree
pointgroup: C01 [X(C13H19N3O1)]
dipole: 0.6123814 -1.9012363 -0.4214468 debye
polarizability: 155.5690743|-0.4578782|184.252866|5.040763|0.8648634|136.2022032 unknown
InChI: InChI=1S/C13H19N3O/c1-14-13(17)16(11-6-4-3-5-7-11)12-8-9-15(2)10-12/h3-7,12,14H,8-10H2,1-2H3
charge 0 multiplicity 1
36 atoms
O  1.346177 2.886793 0.240985
N  -3.259599 0.437229 0.475179
N  0.353412 0.76224 0.027156
N  2.713546 0.99484 0.151056
C  -1.000668 1.379174 0.007533
C  -1.806035 1.188788 -1.313936
C  -1.99156 0.873118 1.135397
C  -3.277269 1.19623 -0.813759
C  -3.366767 -1.03155 0.29332
C  0.51038 -0.66996 -0.058436
C  1.471548 1.623717 0.147728
C  0.622973 -1.447268 1.125262
C  0.566678 -1.31686 -1.321113
C  0.769458 -2.850561 1.047202
C  0.706577 -2.72136 -1.396227
C  0.80427 -3.49147 -0.213522
C  3.955029 1.763801 0.264062
H  -0.795557 2.453509 0.156197
H  -1.57723 0.211713 -1.775773
H  -1.58443 1.982284 -2.047989
H  -1.563704 0.045476 1.725179
H  -2.205161 1.709137 1.827107
H  -3.606996 2.234223 -0.610566
H  -3.991693 0.743137 -1.521899
H  -4.328499 -1.263341 -0.198612
H  -3.373327 -1.519782 1.283746
H  -2.546197 -1.493287 -0.308933
H  0.60611 -0.940481 2.096431
H  0.516239 -0.710931 -2.231926
H  2.759808 -0.020603 0.066578
H  0.854717 -3.4410 1.966181
H  0.746249 -3.212527 -2.37483
H  0.91297 -4.579932 -0.273918
H  4.600246 1.624516 -0.624229
H  4.527101 1.480899 1.168218
H  3.679603 2.827892 0.338053
