program: Gaussian 09
title: 000209543
version: EM64L-G09RevD.01
frameworkgroup: C1[X(C7H15N3O)]
method: RPBEPBE
basis: SDD
operation: Freq
keyword: #p
keyword: freq=noraman
keyword: PBEPBE/SDD
title: #p freq=noraman PBEPBE/SDD
converged: YES YES NO NO
title: Mulliken charges:
elementType: O N N N C C C C C C C H H H H H H H H H H H H H H H
charge: -0.312017 -0.043462 -0.410982 -0.655684 -0.053178 -0.495775 -0.469186 -0.434601 -0.294005 -0.676750 0.274947 0.276674 0.237822 0.219027 0.237448 0.221262 0.225415 0.221252 0.154999 0.211867 0.277386 0.233873 0.212842 0.204125 0.297308 0.339390
chargesum: 0.00000
title: Mulliken charges with hydrogens summed into heavy atoms:
elementType: O N N N C C C C C C C
charge: -0.312017 -0.043462 -0.133596 -0.018985 0.223496 -0.038926 -0.010476 0.012067 0.072862 -0.025909 0.274947
polarizability: 1.15239399e+02 2.92609249e+00 9.67197187e+01 3.74705264e+00 -6.46577857e+00 8.33301532e+01
1716.lowfreq: -17.1941 -0.0011 -0.0006 -0.0003 3.7088 12.0651 25.8961 27.8629 77.5452
frequency: 24.5029 26.8060 77.4010 99.1634 141.7426 191.5333 228.4396 249.0828 286.2482 317.1763 366.8370 402.5734 427.9868 462.7366 468.9390 528.1789 575.4355 628.3846 681.0383 713.2058 765.8710 800.4389 839.5185 846.5982 902.4615 925.0836 943.6151 964.6256 1023.3656 1033.3163 1046.8934 1059.9210 1087.8135 1098.9762 1114.6590 1170.3154 1185.6954 1209.5333 1249.1242 1269.7072 1281.6084 1284.7390 1297.8113 1318.7113 1320.6097 1355.6785 1360.4485 1386.1893 1455.7696 1463.2059 1468.8881 1470.7524 1476.4056 1487.6745 1494.5241 1600.0891 1648.3245 2820.0453 2985.1537 2986.6615 2997.1645 3002.9438 3018.0523 3055.8477 3072.2354 3077.1891 3083.2649 3091.8105 3095.7397 3537.3189 3546.0934 3702.5954
redmass: 4.6161 3.6151 2.8551 2.5832 1.7969 4.2807 1.2804 1.1204 2.2439 3.5640 2.3853 2.2673 2.5763 1.1815 2.3091 1.2246 4.1013 2.7388 3.4518 9.1284 2.9416 1.1994 2.3036 2.0128 2.8116 2.5400 2.3350 2.0079 1.8101 2.6054 2.6330 2.5681 2.0742 1.8500 1.6767 1.7181 1.7883 1.4890 1.3196 1.3268 1.2688 1.2999 1.2962 1.5434 1.2975 1.5774 1.4242 1.2288 1.0694 1.1010 1.0663 1.0741 1.1014 1.1926 1.7598 1.3494 3.4650 1.0704 1.0369 1.0650 1.0667 1.0634 1.0866 1.0879 1.0970 1.0985 1.1015 1.0991 1.1000 1.0690 1.0533 1.1038
irintensity: 10.8770 1.4667 5.8186 2.9133 2.0939 14.7387 0.8624 11.3785 0.9476 1.0211 11.8874 17.5988 3.0952 344.9280 10.4006 47.8115 7.3544 6.4484 18.5293 20.1945 1.8385 5.4237 3.7944 4.4951 3.1260 8.8072 16.5157 0.2414 2.1679 12.0506 37.7781 14.7621 8.1171 2.8449 16.1537 10.0246 1.8375 30.2335 11.7943 0.6203 29.0941 16.1889 30.8945 21.9249 8.6034 82.6904 31.2402 21.1256 5.5599 7.9115 12.9664 7.2989 25.8972 101.6758 349.2162 105.8731 293.4166 136.3235 40.3574 42.3926 48.3082 22.1751 20.8752 4.4114 19.5007 52.1272 47.8042 20.8224 44.7212 24.7982 17.4906 35.4831
temp: 298.150 k
press: 1.00000 atm
elementType: 8 7 7 7 6 6 6 6 6 6 6 1 1 1 1 1 1 1 1 1 1 1 1 1 1 1
symmnumber: 1
zpe: 590228.4 jmol-1
zpe.correction: 0.224806 hartree
zpe.thermalcorrener: 0.237084 hartree
zpe.thermalcorrenthalpy: 0.238028 hartree
zpe.thermalcorrgfe: 0.184924 hartree
zpe.sumelectzpe: -514.334160 hartree
zpe.sumelectthermal: -514.321882 hartree
zpe.sumelectthermalent: -514.320938 hartree
zpe.sumelectthermalfe: -514.374042 hartree
dipole: -1.2834 2.4766 -3.7534
dipole: 4.6764
quadrupole: -75.0957 -62.4388 -67.7009
quadrupole: 9.2643 -5.4881 -2.4269
quadrupole: -6.6839 5.9730 0.7109 9.2643 -5.4881 -2.4269
hfenergy: -514.5589659 hartree
pointgroup: C01 [X(C7H15N3O1)]
dipole: 0.5554997 -0.0763095 1.7522971 debye
dipolederiv: -0.9049446 0.069093 -0.1850004 0.0723118 -0.41794 -0.0695811 -0.3065316 -0.055234 -0.9377228 -0.6857105 -0.1304863 -0.0665592 -0.1775566 -0.4955452 -0.0660624 0.0462053 -0.0568718 -0.4876115 -1.4259295 0.2059602 0.1705382 0.2693284 -0.5607156 -0.007039 0.0734631 0.0551693 -0.3091688 -0.7618372 0.0601614 0.4414032 0.1238856 -0.8220535 -0.1485921 0.6069565 -0.1674208 -0.8423255 0.3448181 -0.0333323 -0.1732021 -0.2541236 0.2608207 0.0524828 -0.427184 0.1463391 0.2412938 -0.2227662 -0.0100348 0.0786282 0.0779956 -0.0916596 0.0324594 0.0742458 0.0325908 0.0904606 0.3694729 0.0130317 0.0891722 -0.009644 0.0779803 -0.0645105 0.1085399 -0.1186275 0.2476125 0.3031009 0.0356395 -0.0345808 0.1255177 0.387169 0.0701094 -0.1224272 0.0674852 0.2437589 0.4096166 0.1221053 0.0256923 0.1286583 0.1947589 0.1227914 0.0060879 0.14268 0.5075822 0.0364056 -0.0678719 0.0135229 -0.0717278 -0.0957824 -0.0451311 -0.0147124 -0.04222 0.0568828 2.1614723 -0.4518223 -0.1759068 -0.4807722 0.4636327 0.3062293 0.0179281 0.2521938 1.4758724 0.0594217 -0.0299437 -0.0740595 -0.0302114 0.0786563 0.0039803 -0.005763 -0.0248917 0.0062307 0.0295264 -0.112744 -0.0432381 -0.0580158 -0.0968754 -0.0633501 -0.0323496 -0.1023711 0.0432774 0.0532282 0.0101918 0.0253416 -0.0010839 0.0714109 -0.0049033 0.0457514 0.0598599 -0.1547274 -0.0360967 -0.0036873 -0.0109132 -0.0358657 0.0801066 -0.0110568 -0.0057924 0.0400787 -0.1857868 0.0786252 0.041367 0.0115807 0.0507302 -0.1220237 -0.0357777 0.0170574 -0.0839215 0.0609623 -0.0824331 0.0973267 -0.0561551 0.0690665 0.0018185 0.0390776 -0.1102352 0.0993454 0.0245954 0.0313106 -0.0394834 0.0076318 -0.0304021 0.0015822 -0.0565921 0.0669817 -0.1228701 -0.1704626 -0.1773073 -0.0664774 0.2174182 -0.0825825 -0.0067019 0.0070627 0.1094498 -0.0187728 -0.2084206 -0.0723021 0.0919235 -0.0748622 0.1172122 -0.051765 0.0586003 -0.0554904 0.0152555 0.0242499 0.1509814 0.0553223 -0.0681969 0.0600854 0.290659 -0.0429403 -0.0142691 -0.0609235 0.0501143 -0.059621 -0.050345 0.0902388 -0.0181457 0.0719515 0.0073816 0.1446454 0.0524955 0.0228274 -0.0520081 0.1370439 -0.049084 0.0970877 -0.0142995 0.0389294 -0.0404976 0.0724151 0.0758396 0.0657148 -0.0405717 -0.0665387 -0.0374379 0.0458473 -0.0489556 -0.1058137 -0.098397 -0.1556712 0.1700041 0.0529735 -0.0639973 0.0517724 0.36931 -0.0371535 -0.0541239 -0.0452398 0.1013782 0.2172577 0.0446602 -0.0288738 0.0439174 0.3796582 -0.0374583 -0.0221223 -0.0381466 0.1789589 unknown
polarizability: 115.1867084|-4.6794148|86.1553663|0.8221455|8.5325445|93.9471965 unknown
InChI: InChI=1S/C7H15N3O/c1-2-10-4-3-6(5-10)9-7(8)11/h6,9H,2-5,8H2,1H3
charge 0 multiplicity 1
26 atoms
O  -3.104895 0.126518 -0.887671
N  2.107452 -0.118246 -0.526636
N  -1.192899 -0.098834 0.452396
N  -3.226135 0.648215 1.381496
C  -0.330011 -0.570499 -0.640877
C  0.43927 -1.886134 -0.280601
C  0.819991 0.438288 -1.037031
C  1.915146 -1.590489 -0.693662
C  2.446531 0.2865 0.866578
C  2.92459 1.747641 0.943864
C  -2.535831 0.217289 0.244196
H  -1.011788 -0.719534 -1.494822
H  0.01697 -2.764453 -0.797289
H  0.368236 -2.076712 0.806868
H  0.877429 0.501832 -2.140175
H  0.628088 1.451701 -0.649466
H  2.660048 -2.153453 -0.106128
H  2.063485 -1.840183 -1.762409
H  1.601286 0.136214 1.590283
H  3.265371 -0.376579 1.204727
H  -0.777856 0.003863 1.379865
H  3.784683 1.896318 0.268681
H  2.131299 2.456037 0.643492
H  3.231568 2.002654 1.975295
H  -2.814564 0.711104 2.309801
H  -4.205962 0.886645 1.255325
