program: Gaussian 09
title: 000209619
version: EM64L-G09RevD.01
frameworkgroup: C1[X(C23H23IN2O2)]
method: RPBEPBE
basis: SDD
operation: Freq
keyword: #p
keyword: freq=noraman
keyword: PBEPBE/SDD
title: #p freq=noraman PBEPBE/SDD
converged: NO YES NO NO
title: Mulliken charges:
elementType: I O O N N C C C C C C C C C C C C C C C C C C C C C C C H H H H H H H H H H H H H H H H H H H H H H H
charge: 0.059709 -0.496279 -0.541017 -0.080709 -0.141418 -0.278539 -0.463113 -0.417787 -0.526268 -0.532370 0.508396 0.330089 0.348516 -0.291429 -0.390061 0.122534 0.161784 -0.356325 -0.311266 -0.339855 -0.238590 -0.192083 -0.389742 -0.401524 -0.256762 -0.259476 -0.208180 -0.216602 0.262769 0.250248 0.232650 0.209652 0.223926 0.243668 0.217808 0.235234 0.255458 0.272728 0.262920 0.254252 0.260050 0.228993 0.246880 0.223837 0.220164 0.228497 0.234299 0.223521 0.232336 0.404971 0.373507
chargesum: 0.00000
title: Mulliken charges with hydrogens summed into heavy atoms:
elementType: I O O N N C C C C C C C C C C C C C C C C C C C C C C C
charge: 0.059709 -0.091308 -0.167511 -0.080709 -0.141418 -0.015770 0.019785 0.015791 -0.064792 -0.041678 0.508396 0.330089 0.348516 -0.018701 -0.127141 0.122534 0.161784 -0.102072 -0.051216 -0.339855 -0.009596 0.054797 -0.165906 -0.181359 -0.028265 -0.025178 0.015342 0.015734
polarizability: 3.06111701e+02 -3.82189487e+00 2.64230225e+02 1.10159189e+01 -2.47430775e+01 2.64817293e+02
1716.lowfreq: -7.8845 -6.6752 0.0002 0.0005 0.0005 1.9064 9.9820 19.1254 30.2634
frequency: 8.2479 19.0900 30.2568 42.8988 56.2337 68.8816 72.6851 97.4776 108.8160 116.4470 133.5602 155.1393 164.8732 182.8537 185.5740 232.4868 244.3890 260.2818 268.5047 272.2838 295.0835 305.5274 319.9470 326.3921 347.9797 373.8659 406.8806 433.8114 439.0273 447.2038 458.2857 481.2894 516.7264 522.4263 529.5332 540.6357 546.7519 590.8535 596.0436 624.8974 640.7185 651.5684 665.5805 696.9133 703.5776 718.5111 735.9100 755.2727 757.5198 762.4768 775.5053 781.6985 788.9809 829.2243 843.6902 843.9318 848.3345 852.7585 870.7116 883.0896 905.6844 924.5503 930.2136 938.6899 941.6648 966.3685 974.5343 977.2178 981.7036 986.8363 990.3770 999.6814 1035.6468 1039.6218 1054.5882 1057.6042 1068.7021 1076.0532 1083.9637 1095.5593 1115.6861 1129.3119 1159.3528 1167.5276 1167.7832 1171.4218 1172.0586 1178.0057 1190.3678 1196.7548 1203.5095 1219.5485 1223.0391 1236.6862 1237.0415 1261.2364 1279.1154 1282.6717 1294.0669 1307.9979 1312.9308 1316.4389 1324.6036 1358.1674 1373.1472 1376.4598 1387.8358 1399.2291 1403.2778 1437.5071 1439.2007 1454.0565 1461.4995 1474.0616 1477.2847 1489.3582 1491.3168 1496.8879 1565.7953 1595.2050 1596.1794 1598.3526 1607.1056 1620.5533 2937.9010 2960.7648 2966.5062 3003.8699 3009.6388 3021.3376 3023.9699 3025.7232 3091.8616 3111.9244 3122.3848 3128.6604 3129.3658 3141.2145 3143.2458 3150.9270 3155.5280 3160.1879 3163.2145 3168.6406 3175.0025 3218.2171 3598.2763
redmass: 7.7774 6.3108 6.8789 5.1624 5.0478 5.0148 5.3104 4.5469 5.0428 4.6135 5.8043 4.4625 3.1974 5.3078 4.7674 3.8935 4.7946 5.1762 3.4296 4.8210 2.8499 3.2880 2.8955 2.6826 1.3498 3.6856 3.9588 3.1654 3.1198 3.5557 3.4285 3.8817 5.4023 4.1373 4.8953 4.9705 4.1872 5.5037 5.8393 5.3773 5.0849 3.3112 5.3668 2.8002 2.6567 2.4593 1.5769 1.6708 1.4350 2.5325 3.3257 2.2042 1.8687 4.6154 2.7301 3.0903 1.4273 1.5908 2.0603 4.0796 1.6702 2.2547 1.5892 1.4434 1.3927 1.9036 1.8024 1.3936 3.7459 1.5908 1.4514 2.3003 2.0745 2.1107 3.6329 2.4055 2.7710 2.9663 1.6050 2.1933 2.1819 2.4609 1.4542 1.1414 1.0863 1.1260 1.4045 1.2481 2.2507 1.2537 1.6215 2.2702 2.5573 1.3185 1.4301 1.7334 1.4097 1.3546 1.3915 1.2545 1.3689 1.3559 1.3015 1.4765 5.8384 2.4330 4.7986 2.7399 2.2291 2.1824 2.3721 2.3272 1.0880 1.1610 1.1999 2.2187 1.4938 1.4107 6.6037 6.3373 6.7534 6.4421 6.6750 6.7745 1.0665 1.0574 1.0592 1.1003 1.0769 1.0907 1.0945 1.0847 1.1043 1.0891 1.0852 1.0867 1.0893 1.0880 1.0945 1.0927 1.0927 1.0941 1.1006 1.0974 1.0982 1.0705 1.0657
irintensity: 0.1884 0.0297 0.1026 0.2605 2.1071 1.1949 1.7356 2.0552 0.3826 4.4569 5.3616 2.2435 0.4734 3.7677 5.9739 3.0470 4.5090 0.4340 7.8940 0.6060 0.9581 2.8514 24.5651 16.8369 102.2548 1.9239 2.8575 3.9120 10.9160 13.4617 6.6257 3.0662 2.0346 11.7121 2.4398 3.0653 1.3384 2.3214 1.9556 4.3802 32.6887 6.9961 24.6212 20.0209 10.0143 50.5025 108.9520 89.7502 67.2578 43.6878 25.2067 39.3096 15.1377 40.7622 19.4558 11.3073 2.3525 5.1042 7.8813 7.3189 9.2203 3.9810 5.2448 2.6412 4.9771 7.4441 2.6620 2.9159 10.1046 9.6826 10.8077 34.4661 3.9111 6.9974 6.6019 12.1093 44.4953 81.0746 2.6770 76.2275 28.6685 27.9114 88.6491 34.6175 1.0091 13.0072 50.3473 16.9142 29.0588 30.7787 15.6915 59.9582 67.7060 9.6590 3.7384 3.1999 14.8295 19.2412 41.0415 12.0656 36.3702 8.8214 9.6895 11.3334 1.7453 1.0098 9.5063 27.0660 6.5866 29.6746 25.1422 32.3790 14.4379 9.7644 20.6292 20.3319 25.6933 0.0940 43.7198 19.1518 12.0182 11.7147 18.9466 2.0541 52.5151 27.6367 79.7910 13.5771 8.9825 25.6479 26.8043 55.9824 29.9444 12.2299 4.4773 6.9496 4.4853 5.5477 26.2049 7.5231 0.1216 15.3786 28.1234 14.8067 16.0902 909.1266 37.8274
temp: 298.150 k
press: 1.00000 atm
elementType: 53 8 8 7 7 6 6 6 6 6 6 6 6 6 6 6 6 6 6 6 6 6 6 6 6 6 6 6 1 1 1 1 1 1 1 1 1 1 1 1 1 1 1 1 1 1 1 1 1 1 1
symmnumber: 1
zpe: 1065378.5 jmol-1
zpe.correction: 0.405781 hartree
zpe.thermalcorrener: 0.430684 hartree
zpe.thermalcorrenthalpy: 0.431628 hartree
zpe.thermalcorrgfe: 0.348065 hartree
zpe.sumelectzpe: -1159.660646 hartree
zpe.sumelectthermal: -1159.635744 hartree
zpe.sumelectthermalent: -1159.634800 hartree
zpe.sumelectthermalfe: -1159.718363 hartree
dipole: 4.4464 -2.0734 -1.5960
dipole: 5.1591
quadrupole: -170.6499 -175.7263 -159.6237
quadrupole: -2.7738 -12.9091 -4.6432
quadrupole: -1.9832 -7.0597 9.0429 -2.7738 -12.9091 -4.6432
hfenergy: -1160.0664277 hartree
pointgroup: C01 [X(C23H23I1N2O2)]
dipole: 1.643426 0.7617882 -0.9158172 debye
polarizability: 270.1085618|31.3273821|287.6227787|13.7600482|-8.7557152|277.4278778 unknown
InChI: InChI=1S/C23H23IN2O2/c24-20-9-5-8-17(14-20)23-25(15-18-6-1-3-10-21(18)27)12-13-26(23)16-19-7-2-4-11-22(19)28/h1-11,14,23,27-28H,12-13,15-16H2
charge 0 multiplicity 1
51 atoms
I  -2.724355 -4.632731 1.219723
O  -0.496533 2.821058 -1.668937
O  1.922782 2.08827 -2.570057
N  -1.243352 1.061383 1.66577
N  1.173133 1.0954 1.475376
C  -0.066693 0.319234 1.106716
C  -0.67513 1.631923 2.925272
C  0.782107 2.06109 2.553069
C  -1.80788 2.130746 0.760574
C  1.911405 1.725832 0.345153
C  -0.060927 -1.104767 1.690299
C  -2.244763 1.558877 -0.575364
C  2.500137 0.705336 -0.626418
C  -1.102999 -1.987268 1.30294
C  0.920472 -1.552258 2.602236
C  -1.539144 1.886909 -1.766562
C  2.5333 0.909091 -2.02922
C  -3.327735 0.650228 -0.663189
C  3.101233 -0.483989 -0.140063
C  -1.138229 -3.291492 1.828697
C  0.862178 -2.861344 3.132653
C  -0.167553 -3.750032 2.747774
C  -1.907607 1.309998 -3.008659
C  3.140388 -0.014674 -2.909769
C  -3.70279 0.069274 -1.89483
C  3.717477 -1.417543 -0.998985
C  -2.983324 0.39834 -3.068591
C  3.741756 -1.18096 -2.392273
H  -0.167596 0.250779 0.008667
H  -0.655783 0.84151 3.696721
H  -1.291791 2.468462 3.291899
H  0.79587 3.10637 2.174133
H  1.463363 2.001731 3.422239
H  -1.094316 2.959995 0.578807
H  -2.682106 2.543679 1.298562
H  2.753071 2.292614 0.792171
H  1.283332 2.460489 -0.199407
H  -1.872294 -1.635413 0.608967
H  1.721047 -0.859555 2.881911
H  -3.863362 0.387063 0.256673
H  3.068023 -0.660426 0.938853
H  1.620648 -3.200917 3.847219
H  -0.209722 -4.765539 3.15177
H  -1.36181 1.587612 -3.918183
H  3.135985 0.169646 -3.992408
H  -4.541096 -0.633945 -1.939869
H  4.170038 -2.324875 -0.58629
H  -3.264539 -0.046594 -4.029864
H  4.212306 -1.898347 -3.072731
H  0.32673 2.567791 -2.191871
H  2.234748 2.240039 -3.495203
