program: Gaussian 09
title: 000209548
version: EM64L-G09RevD.01
frameworkgroup: C1[X(C18H21N3O)]
method: RPBEPBE
basis: SDD
operation: Freq
keyword: #p
keyword: freq=noraman
keyword: PBEPBE/SDD
title: #p freq=noraman PBEPBE/SDD
converged: YES YES NO NO
title: Mulliken charges:
elementType: O N N N C C C C C C C C C C C C C C C C C C H H H H H H H H H H H H H H H H H H H H H
charge: -0.298662 -0.066090 -0.450273 -0.497414 -0.043931 -0.500050 -0.482447 -0.431853 -0.477557 0.451729 0.284511 -0.363084 -0.453867 -0.228848 -0.218723 -0.242943 0.475187 -0.449804 -0.343809 -0.198253 -0.213771 -0.261395 0.275217 0.243567 0.226467 0.238670 0.245922 0.225241 0.223917 0.235454 0.166368 0.278725 0.270566 0.224181 0.284396 0.226657 0.224835 0.228735 0.211605 0.307555 0.223022 0.223735 0.226512
chargesum: 0.00000
title: Mulliken charges with hydrogens summed into heavy atoms:
elementType: O N N N C C C C C C C C C C C C C C C C C C
charge: -0.298662 -0.066090 -0.171548 -0.213018 0.231286 -0.030016 0.002146 0.017304 -0.075735 0.451729 0.284511 -0.092518 -0.229686 -0.002191 0.006112 -0.014208 0.475187 -0.238199 -0.036254 0.024769 0.009964 -0.034883
polarizability: 2.73231289e+02 1.53931034e+01 2.27038033e+02 -8.40421359e+00 -1.81120451e+01 1.52297024e+02
1716.lowfreq: -11.5320 -10.5138 -5.2201 -0.0010 -0.0004 -0.0004 4.7529 12.8466 25.3740
frequency: -8.0969 12.7807 25.2999 40.1038 49.1180 53.2036 79.4149 93.6025 102.5447 159.1016 214.0179 222.6606 228.6421 247.2208 307.8901 327.8707 338.0331 345.4608 390.5258 406.4115 407.3858 416.7659 437.1698 472.3045 510.2264 565.0637 582.0475 584.4540 613.9502 616.2806 636.5804 679.4357 695.2824 700.1607 706.3078 737.6861 749.8231 763.5318 800.5998 804.9276 824.1923 837.1947 855.0352 859.7341 877.3668 906.9063 910.1743 914.1590 944.4190 959.1203 967.2963 980.6454 983.4673 985.8814 990.1090 996.4681 1003.8934 1022.6380 1025.1076 1029.8242 1045.5993 1071.1714 1079.8160 1088.8872 1095.6397 1123.5382 1170.5695 1170.8352 1173.9486 1179.8648 1184.8073 1187.4809 1207.9403 1213.7595 1240.3359 1245.1869 1268.4571 1279.8720 1295.6724 1305.3449 1315.1627 1318.1917 1322.5930 1341.0577 1349.6698 1383.7727 1386.2140 1427.0841 1439.2338 1460.1180 1462.8053 1469.5250 1475.0596 1476.9653 1482.8209 1487.6365 1513.6340 1593.8806 1598.8588 1614.5328 1616.7046 1642.1238 2816.7260 2990.2453 2991.4031 3000.5651 3009.1483 3058.0636 3072.3492 3085.1377 3089.6674 3102.6443 3104.5200 3124.7827 3129.4308 3137.1040 3141.1658 3151.3942 3163.3666 3163.4399 3194.5861 3522.2167 3534.7991
redmass: 4.3711 5.1981 3.9389 4.7291 4.7844 4.0508 4.0341 4.4519 3.9519 3.1167 4.2731 3.4544 3.1242 4.8265 1.9381 2.0813 2.9181 3.4066 3.0698 2.8521 2.9270 2.4508 2.8416 2.9164 2.6422 4.1028 3.6449 1.3762 6.1261 6.2918 2.9214 5.5459 1.9764 10.7439 2.1806 2.2862 2.4625 1.7032 3.7970 3.8781 3.1668 1.2771 2.0603 1.2503 3.1812 2.3043 1.4354 1.3835 2.3595 3.0408 1.3476 1.8322 3.0834 1.9764 5.7091 1.3032 1.3979 2.4247 2.3013 2.3660 2.4802 2.4489 1.6067 1.5864 2.2154 2.0572 1.0619 1.0510 1.4163 1.1367 1.3551 1.1153 2.3012 1.7028 1.3317 1.3243 2.1906 1.4223 1.2233 1.5100 1.4638 1.4764 1.2325 1.3708 1.5213 5.4122 5.6413 2.3823 2.1452 1.0934 1.1827 1.0949 1.1422 1.6611 1.9830 2.2730 2.2491 6.1960 5.8305 6.1417 5.7724 4.3686 1.0709 1.0778 1.0710 1.0664 1.0636 1.0879 1.0979 1.1019 1.1010 1.0885 1.0880 1.0860 1.0865 1.0918 1.0932 1.0949 1.1000 1.1007 1.0949 1.0765 1.0767
irintensity: 3.2685 1.1269 0.2026 0.2393 7.6509 2.3259 0.2992 0.8554 2.0345 1.5067 3.0608 3.7956 1.0240 19.2735 6.2342 3.7880 2.8583 2.5436 5.2975 0.3180 0.0496 1.7897 6.9502 17.4453 54.4773 1.7331 16.4326 91.4202 1.3043 0.3270 0.7123 12.1611 49.1495 8.7375 36.7181 27.7551 42.4011 93.3205 10.9496 6.9085 7.0763 0.1380 11.8717 0.1595 6.8456 1.8936 14.1124 3.7952 3.9887 12.3002 0.1320 4.8127 1.0728 4.4371 0.3885 3.0762 3.4776 36.9670 13.0167 13.9927 22.4990 7.1182 9.5172 8.8505 16.7483 5.9391 0.5076 0.5049 33.8830 8.9327 0.7861 5.7475 0.4276 255.1404 73.4210 61.1846 11.6940 8.2220 6.3177 19.5604 2.2520 60.5026 5.9275 71.4557 7.8925 86.1088 4.4027 49.1746 17.9296 16.7582 60.2707 18.4364 68.2420 297.7719 44.2189 1.2760 585.1200 0.9933 45.7483 6.8504 69.3620 177.4002 102.8757 15.3172 69.6579 32.9652 20.1338 6.2411 27.4054 15.9461 43.1832 20.7495 15.0998 0.3576 0.3901 25.0453 33.9076 22.5637 30.9515 20.0487 8.8840 5.6339 20.7647
temp: 298.150 k
press: 1.00000 atm
elementType: 8 7 7 7 6 6 6 6 6 6 6 6 6 6 6 6 6 6 6 6 6 6 1 1 1 1 1 1 1 1 1 1 1 1 1 1 1 1 1 1 1 1 1
symmnumber: 1
zpe: 935399.9 jmol-1
zpe.correction: 0.356275 hartree
zpe.thermalcorrener: 0.375191 hartree
zpe.thermalcorrenthalpy: 0.376135 hartree
zpe.thermalcorrgfe: 0.305942 hartree
zpe.sumelectzpe: -936.397972 hartree
zpe.sumelectthermal: -936.379056 hartree
zpe.sumelectthermalent: -936.378112 hartree
zpe.sumelectthermalfe: -936.448305 hartree
dipole: -2.3008 1.7592 -2.7340
dipole: 3.9828
quadrupole: -137.5134 -122.9922 -129.0442
quadrupole: 7.4811 -4.1232 -1.2952
quadrupole: -7.6635 6.8577 0.8057 7.4811 -4.1232 -1.2952
hfenergy: -936.7542468 hartree
pointgroup: C01 [X(C18H21N3O1)]
dipole: -0.8504802 -0.1143577 1.3111054 debye
polarizability: 274.0307968|-12.5469494|197.0204025|10.0352241|-40.5789975|181.5151471 unknown
InChI: InChI=1S/C18H21N3O/c22-18(19-16-9-5-2-6-10-16)20-17-11-12-21(14-17)13-15-7-3-1-4-8-15/h1-10,17,19-20H,11-14H2
charge 0 multiplicity 1
43 atoms
O  2.206364 1.250439 -1.739604
N  -2.951015 1.674089 -0.598317
N  0.408077 1.041985 -0.258457
N  2.459172 0.049309 0.283986
C  -0.531416 1.782342 -1.115179
C  -1.006382 3.143676 -0.495625
C  -1.875329 1.003786 -1.386808
C  -2.558475 3.114593 -0.655166
C  -3.100901 1.158674 0.788603
C  -3.687834 -0.24996 0.837133
C  1.730506 0.811402 -0.648805
C  -4.651754 -0.665157 -0.116033
C  -3.308445 -1.149773 1.863737
C  -5.22781 -1.952184 -0.038567
C  -3.886602 -2.437602 1.946412
C  -4.849114 -2.843226 0.993791
C  3.824141 -0.344624 0.21803
C  4.323984 -1.134824 1.290507
C  4.690886 0.011799 -0.850728
C  5.666837 -1.562336 1.297729
C  6.033136 -0.424432 -0.826207
C  6.534134 -1.209494 0.237562
H  0.020216 1.950434 -2.054854
H  -0.542197 4.006525 -1.001951
H  -0.716111 3.189993 0.570091
H  -2.126685 1.086567 -2.460667
H  -1.801889 -0.067131 -1.137294
H  -3.093761 3.699828 0.111712
H  -2.842103 3.511766 -1.648686
H  -3.787724 1.855258 1.310135
H  -2.147679 1.16971 1.380728
H  0.065428 0.702742 0.642198
H  -4.924518 0.032618 -0.914798
H  -2.561513 -0.840553 2.607064
H  1.956135 -0.286939 1.107912
H  -5.970912 -2.261752 -0.782469
H  -3.584391 -3.122812 2.7467
H  -5.29562 -3.842276 1.052369
H  3.659142 -1.415052 2.118964
H  4.302192 0.613439 -1.673979
H  6.033982 -2.17112 2.13167
H  6.693926 -0.144815 -1.6548
H  7.57782 -1.541112 0.241455
