program: Gaussian 09
title: 000209552
version: EM64L-G09RevD.01
frameworkgroup: C1[X(C17H19N3O)]
method: RPBEPBE
basis: SDD
operation: Freq
keyword: #p
keyword: freq=noraman
keyword: PBEPBE/SDD
title: #p freq=noraman PBEPBE/SDD
converged: YES YES NO NO
title: Mulliken charges:
elementType: O N N N C C C C C C C C C C C C C C C C C H H H H H H H H H H H H H H H H H H H
charge: -0.286347 -0.233868 -0.431591 -0.361093 -0.041420 -0.448437 -0.503439 -0.469368 0.229875 0.407367 0.269057 -0.367463 -0.343084 -0.341522 -0.361256 -0.223222 -0.206527 -0.223889 -0.209129 -0.255510 -0.242173 0.274867 0.228109 0.220369 0.212145 0.237007 0.240008 0.213871 0.259412 0.320200 0.254014 0.265279 0.276125 0.267975 0.223145 0.232304 0.224253 0.233726 0.226468 0.233765
chargesum: 0.00000
title: Mulliken charges with hydrogens summed into heavy atoms:
elementType: O N N N C C C C C C C C C C C C C C C C C
charge: -0.286347 0.025543 -0.111392 -0.361093 0.233448 0.000041 -0.054287 -0.015489 0.229875 0.407367 0.269057 -0.113449 -0.077805 -0.065398 -0.093280 -0.000077 0.025777 0.000364 0.024597 -0.029042 -0.008408
polarizability: 2.47726583e+02 -1.81532017e+01 2.29462423e+02 7.31082283e+00 -7.61050756e+00 1.47123694e+02
1716.lowfreq: -16.8552 -4.8586 -0.0002 0.0001 0.0006 4.0496 6.3156 21.2159 35.9414
frequency: -14.7882 21.1313 35.8722 43.6621 48.0406 64.4866 74.7973 77.5538 129.5416 188.4398 226.6386 245.1681 260.0856 269.3151 307.3871 362.0263 386.0773 405.6998 409.1406 422.5708 458.1841 509.1061 514.4539 537.2418 602.7536 612.0279 614.7828 616.6587 648.6320 672.3749 692.6614 697.7801 702.3441 709.6530 749.1430 762.2353 779.7686 831.1679 835.2443 849.7728 860.3481 901.8721 906.2804 910.3116 921.5855 926.6679 963.4977 965.7301 976.6627 984.2118 987.0884 988.5098 995.4934 1018.9496 1020.7877 1027.3067 1032.6737 1049.2741 1076.0300 1084.0117 1092.2331 1107.8227 1171.5086 1172.1658 1172.7973 1177.4124 1179.8284 1192.1593 1216.9643 1234.4797 1245.2609 1282.7928 1286.8164 1293.6903 1306.0549 1310.6394 1320.4572 1326.4503 1353.5113 1371.5573 1384.0040 1422.9020 1435.8074 1443.7377 1459.5805 1466.1581 1476.0125 1477.9739 1481.5445 1487.2777 1583.4380 1591.0171 1601.5851 1605.8956 1620.4780 2970.7523 2986.0989 3005.9929 3062.1365 3072.3726 3078.1278 3086.5614 3125.7918 3130.6357 3135.7455 3137.9541 3150.6637 3151.4967 3158.0549 3164.5780 3170.6528 3194.4882 3428.2148 3533.8616
redmass: 3.4932 3.9339 3.4696 4.8238 3.7397 4.0092 4.5627 4.7096 4.9292 4.3021 4.5759 4.7731 2.3226 3.0046 4.9753 6.0294 2.8939 2.8798 2.8905 4.9131 3.1083 3.6214 3.4459 1.2785 3.2620 5.7443 5.3218 3.2788 6.2863 4.4404 1.9718 3.0871 3.1531 1.6024 2.6386 1.7473 2.5620 1.2672 2.0613 1.2600 2.2995 1.4557 2.7658 2.2595 2.3822 1.9049 1.7080 2.3895 1.3843 1.5805 3.3474 5.7955 1.3224 1.8204 1.9806 2.0510 2.2164 2.7362 1.5708 2.0065 1.7267 3.5292 1.0583 1.1015 1.4447 1.2820 1.2434 1.1365 2.1892 3.3331 1.4874 2.2668 1.6291 1.3071 1.2562 1.4436 1.2831 1.3563 1.3451 7.2495 9.0724 1.1433 2.2684 2.3734 1.0899 1.1567 1.1891 2.3217 1.7550 1.7608 6.1634 6.4457 6.1520 6.7344 7.4993 1.0681 1.0675 1.0623 1.0905 1.0981 1.0966 1.1002 1.0847 1.0850 1.0894 1.0884 1.0929 1.0938 1.0968 1.0999 1.1017 1.0948 1.0753 1.0767
irintensity: 0.8870 1.3109 1.5369 3.9319 0.8847 0.6440 2.3569 1.0817 1.5750 2.1807 4.4361 6.5203 12.8205 2.8328 0.4883 6.3545 0.9639 3.1301 0.7371 2.8976 7.5205 15.9718 21.9954 66.7126 18.4781 0.2295 1.8284 5.4999 13.9107 2.6889 35.8075 13.2012 94.8754 170.8895 16.5143 81.5128 4.3320 0.3165 14.0702 0.7751 1.9500 2.8882 7.5998 12.4958 1.6510 0.5267 1.5699 1.9037 0.0748 0.1127 0.3813 0.4157 0.0519 0.3959 3.0883 9.2501 11.9512 6.6038 9.4813 8.1170 2.6088 9.9494 0.2757 1.0830 9.7572 32.4485 9.8134 1.5806 151.0883 261.0819 2.7444 92.7357 47.6876 32.2407 0.8820 15.1906 58.0461 11.2831 66.2364 2.2928 0.2619 10.1437 5.4527 7.4098 7.1313 81.0310 133.9412 56.7065 273.9709 128.2621 17.2063 1.3753 100.6401 68.0067 201.1486 57.7493 44.5121 21.7131 9.4642 11.5894 10.9110 81.9783 1.9261 1.6000 13.9761 4.6605 26.5056 24.2653 17.6558 24.0563 13.3833 1.7210 0.8448 16.8591
temp: 298.150 k
press: 1.00000 atm
elementType: 8 7 7 7 6 6 6 6 6 6 6 6 6 6 6 6 6 6 6 6 6 1 1 1 1 1 1 1 1 1 1 1 1 1 1 1 1 1 1 1
symmnumber: 1
zpe: 861712.7 jmol-1
zpe.correction: 0.328209 hartree
zpe.thermalcorrener: 0.345911 hartree
zpe.thermalcorrenthalpy: 0.346856 hartree
zpe.thermalcorrgfe: 0.280141 hartree
zpe.sumelectzpe: -897.172685 hartree
zpe.sumelectthermal: -897.154982 hartree
zpe.sumelectthermalent: -897.154038 hartree
zpe.sumelectthermalfe: -897.220753 hartree
dipole: -0.9179 2.8630 1.4361
dipole: 3.3319
quadrupole: -120.3502 -117.9347 -120.2489
quadrupole: 8.9311 0.8916 -3.9810
quadrupole: -0.8390 1.5766 -0.7376 8.9311 0.8916 -3.9810
hfenergy: -897.5008937 hartree
pointgroup: C01 [X(C17H19N3O1)]
dipole: 0.2762875 1.0894781 -0.6745741 debye
polarizability: 246.2259663|19.4771675|231.9780239|0.7088557|-0.2719339|146.1087093 unknown
InChI: InChI=1S/C17H19N3O/c21-17(19-14-11-12-18-13-14)20(15-7-3-1-4-8-15)16-9-5-2-6-10-16/h1-10,14,18-19H,11-13H2
charge 0 multiplicity 1
40 atoms
O  0.476521 -2.289041 0.786179
N  5.316488 -0.215652 0.13561
N  1.707795 -0.459042 0.034698
N  -0.662498 -0.30736 0.155375
C  3.009231 -1.11859 0.212993
C  3.710835 -1.52356 -1.130301
C  4.049691 -0.154368 0.909327
C  4.896075 -0.520196 -1.263608
C  0.515209 -1.096268 0.358729
C  -1.980003 -0.894961 0.218913
C  -0.563462 1.116054 -0.094798
C  -3.068753 -0.100188 0.667062
C  -1.02817 1.651242 -1.323041
C  -2.219105 -2.235556 -0.1846
C  -0.022421 1.982357 0.890043
C  -4.374179 -0.634724 0.702705
C  -0.94652 3.039965 -1.564434
C  -3.527407 -2.760953 -0.13461
C  0.069465 3.369606 0.637365
C  -4.614171 -1.969012 0.303591
C  -0.393041 3.903059 -0.588501
H  2.803529 -2.01219 0.823584
H  3.003019 -1.491987 -1.976488
H  4.099587 -2.555714 -1.052361
H  3.652542 0.880548 0.877982
H  4.221388 -0.412273 1.967806
H  5.745619 -0.910372 -1.848736
H  4.558115 0.4188 -1.744522
H  5.940455 -0.950941 0.499078
H  1.688847 0.485775 -0.353942
H  -2.893841 0.931255 0.988994
H  -1.454928 0.975257 -2.071303
H  -1.3866 -2.862622 -0.507618
H  0.313368 1.564505 1.845194
H  -5.201618 -0.006665 1.05179
H  -1.308766 3.447095 -2.514785
H  -3.696302 -3.79842 -0.444737
H  0.488745 4.03302 1.401717
H  -5.626939 -2.384872 0.336452
H  -0.327701 4.97959 -0.779601
