program: Gaussian 09
title: 000209524
version: EM64L-G09RevD.01
frameworkgroup: C1[X(C20H23NO2)]
method: RPBEPBE
basis: SDD
operation: Freq
keyword: #p
keyword: freq=noraman
keyword: PBEPBE/SDD
title: #p freq=noraman PBEPBE/SDD
converged: YES YES NO NO
title: Mulliken charges:
elementType: O O N C C C C C C C C C C C C C C C C C C C C H H H H H H H H H H H H H H H H H H H H H H H
charge: -0.300851 -0.244295 -0.251472 -0.254918 -0.033900 -0.398025 -0.470768 -0.362309 -0.467976 0.497477 0.480981 -0.448518 -0.414281 -0.388997 -0.374191 0.309000 -0.222414 -0.235908 -0.235438 -0.259084 -0.247042 -0.246870 -0.770639 0.221322 0.285289 0.231845 0.205720 0.256871 0.209720 0.197772 0.260061 0.225883 0.204406 0.228465 0.230101 0.244238 0.256786 0.225292 0.220619 0.223357 0.220109 0.227393 0.224478 0.246761 0.246184 0.247768
chargesum: 0.00000
title: Mulliken charges with hydrogens summed into heavy atoms:
elementType: O O N C C C C C C C C C C C C C C C C C C C C
charge: -0.300851 -0.244295 0.008589 -0.033596 0.251388 -0.166180 -0.008178 0.045182 -0.037687 0.497477 0.480981 -0.220053 -0.184180 -0.144760 -0.117406 0.309000 0.002878 -0.015289 -0.012081 -0.038974 -0.019649 -0.022392 -0.029926
polarizability: 2.37180705e+02 -2.31418805e+01 2.27594737e+02 -5.96754356e+00 9.44609711e+00 1.90296107e+02
1716.lowfreq: -35.5894 -1.7946 -0.0006 -0.0003 0.0003 3.4602 8.3522 20.5958 32.5889
frequency: -35.5609 20.5906 32.5351 42.6255 49.0662 58.1684 59.3913 75.6168 96.1640 111.6021 158.7112 183.0333 207.9906 212.2038 239.9515 244.9357 281.7343 288.1750 314.1745 361.1531 400.7310 404.4505 407.3944 466.1392 473.0293 488.7463 526.7180 553.7391 576.1704 594.4008 607.0187 616.2966 620.0501 634.2505 642.8286 685.5733 698.9265 708.3162 749.8793 764.7769 805.9379 821.2929 839.6418 843.6347 854.1189 854.9620 862.3980 900.7640 910.9820 920.7232 925.4616 935.1025 960.2330 968.8478 976.7743 989.7661 991.2112 991.8752 994.0606 996.1746 1026.5376 1028.9431 1044.2049 1058.4256 1064.7056 1069.6201 1079.3202 1087.8200 1108.4000 1128.0412 1170.8719 1171.4584 1179.7999 1187.7702 1191.5923 1194.0303 1196.6674 1203.4051 1212.4185 1227.8275 1264.2805 1272.6339 1296.0738 1313.3449 1322.7092 1328.3042 1337.6005 1341.2764 1347.9309 1353.1463 1359.9670 1380.6573 1382.0712 1384.1426 1437.2827 1441.6245 1447.6222 1454.0026 1456.1663 1457.8690 1461.4746 1467.2280 1480.2243 1484.5776 1590.6484 1592.6407 1608.9344 1613.4590 1640.1203 2946.7828 2963.0716 2979.9135 2983.9256 2990.5602 3006.4380 3040.2188 3045.4132 3050.2577 3060.2253 3094.6935 3111.0078 3114.5273 3119.4654 3122.4932 3133.2030 3135.2310 3136.3710 3143.5835 3154.3801 3162.1745 3168.8957 3438.6362
redmass: 1.0454 4.7405 3.8403 7.4707 4.0154 3.6714 5.0196 4.4800 3.4816 3.2440 3.8369 6.6391 3.9283 4.3047 4.1317 3.9792 4.3247 2.6965 3.0393 2.5454 2.7755 2.8227 2.8525 3.2239 3.1973 2.9557 3.3563 2.9402 3.4149 4.8604 3.4486 6.1733 5.8529 3.7488 2.2952 2.8482 1.6670 1.6447 2.2688 2.0439 3.2319 2.8624 3.4351 1.3013 1.7332 1.6546 1.7271 5.2829 1.6282 1.8201 1.7821 2.4352 2.8205 1.4220 1.4024 1.3370 4.5720 5.3783 1.3998 1.8164 2.3033 2.2401 1.6283 1.9777 2.0259 1.7759 1.6190 1.6508 2.3429 2.9037 1.0545 1.0595 1.4608 1.1637 1.7892 1.6096 2.3502 2.1909 1.7158 1.3270 1.5481 1.4511 1.4960 1.3330 1.3567 1.3542 1.2708 1.3664 1.3541 1.2578 1.3761 6.6247 1.2461 6.2868 2.1945 2.0190 1.1589 1.0940 1.0660 1.0538 1.1305 1.0873 2.2524 2.2483 6.0792 5.9859 6.0629 6.0698 10.4636 1.0816 1.0660 1.0645 1.0616 1.0827 1.0363 1.0961 1.0881 1.0996 1.0991 1.0972 1.0866 1.0868 1.0861 1.0867 1.0908 1.1013 1.0930 1.0958 1.0974 1.1013 1.0969 1.0742
irintensity: 1.1298 0.1322 0.2336 0.9617 0.2200 1.4301 0.3964 1.8235 0.1271 1.2161 0.8023 6.3197 2.4432 4.2069 2.1158 0.7056 0.7494 1.6802 0.5821 5.6279 0.2461 0.4423 3.4044 4.9346 4.8900 5.4986 24.6548 32.6931 7.9729 20.6360 23.1712 3.1975 3.4644 3.7206 53.0405 32.3673 55.3549 62.7757 30.5833 44.2622 9.0318 4.2924 5.4598 0.4954 6.1944 3.9840 16.3607 57.4763 7.0906 6.4327 7.0088 5.3620 25.3671 0.1985 0.0893 0.1237 0.7565 0.6052 0.4928 39.4238 5.1633 12.6042 9.7568 1.8249 0.8498 20.2553 3.6567 7.2363 3.1916 45.4823 0.3420 0.9027 42.8576 16.2403 6.9485 66.6352 252.6280 10.5482 6.9853 7.3051 2.4605 5.8043 2.4255 0.7216 0.4944 4.8590 2.9261 4.4956 1.9609 2.2775 3.4515 0.6355 55.3506 1.4022 8.9076 10.5555 17.2989 11.6731 13.3118 15.5190 6.1314 18.0934 19.0672 21.2072 3.1044 0.0913 11.8897 5.3711 173.4603 12.4412 47.4192 21.8089 40.3631 20.3790 3.6804 64.8363 8.6592 44.9125 32.3082 7.0242 7.8235 10.7904 1.9495 0.6975 10.6945 9.9613 31.7050 38.6126 46.8438 27.1077 9.1896 0.2251
temp: 298.150 k
press: 1.00000 atm
elementType: 8 8 7 6 6 6 6 6 6 6 6 6 6 6 6 6 6 6 6 6 6 6 6 1 1 1 1 1 1 1 1 1 1 1 1 1 1 1 1 1 1 1 1 1 1 1
symmnumber: 1
zpe: 1005177.5 jmol-1
zpe.correction: 0.382852 hartree
zpe.thermalcorrener: 0.403284 hartree
zpe.thermalcorrenthalpy: 0.404228 hartree
zpe.thermalcorrgfe: 0.331703 hartree
zpe.sumelectzpe: -979.448032 hartree
zpe.sumelectthermal: -979.427600 hartree
zpe.sumelectthermalent: -979.426656 hartree
zpe.sumelectthermalfe: -979.499181 hartree
dipole: -0.5063 -1.1298 0.7681
dipole: 1.4570
quadrupole: -140.8321 -131.5255 -124.2013
quadrupole: 6.7810 -8.4480 4.6480
quadrupole: -8.6458 0.6608 7.9850 6.7810 -8.4480 4.6480
hfenergy: -979.8308841 hartree
pointgroup: C01 [X(C20H23N1O2)]
dipole: -0.2329064 -0.493827 0.1745812 debye
polarizability: 233.199849|-21.0970801|222.9953646|-11.7970144|19.468201|198.8763353 unknown
InChI: InChI=1S/C20H23NO2/c1-15(22)23-18-13-8-14-21-20(18)19(16-9-4-2-5-10-16)17-11-6-3-7-12-17/h2-7,9-12,18-21H,8,13-14H2,1H3
charge 0 multiplicity 1
46 atoms
O  -2.402122 -0.552363 0.700949
O  -3.975154 1.166366 0.538965
N  -0.512834 -2.344123 -0.700013
C  -0.4849 -0.865685 -0.771677
C  -1.907466 -0.246515 -0.690403
C  0.48628 -0.276202 0.296474
C  -2.856929 -0.8778 -1.728766
C  -2.868379 -2.421538 -1.641314
C  -1.417239 -2.96852 -1.695699
C  0.525783 1.25899 0.202625
C  1.91332 -0.84869 0.244365
C  -0.098933 2.063389 1.187441
C  2.752505 -0.65473 1.372228
C  1.182618 1.900712 -0.879737
C  2.452785 -1.506761 -0.888393
C  -3.445478 0.237793 1.191231
C  -0.076382 3.473921 1.094915
C  4.092708 -1.098032 1.372538
C  1.203579 3.308542 -0.979023
C  3.796149 -1.946847 -0.896188
C  0.572773 4.10224 0.008425
C  4.623348 -1.744436 0.231961
C  -3.831905 -0.183007 2.595005
H  -0.10821 -0.592104 -1.782067
H  -1.889102 0.852209 -0.801319
H  0.058265 -0.532967 1.286815
H  -2.501294 -0.564445 -2.732108
H  -3.869281 -0.454778 -1.604212
H  -3.345236 -2.737616 -0.6931
H  -3.468966 -2.844289 -2.470013
H  -0.714382 -2.661112 0.25876
H  -1.401894 -4.062856 -1.54191
H  -0.994637 -2.775219 -2.703707
H  -0.606208 1.581161 2.032675
H  2.352114 -0.139708 2.25506
H  1.699975 1.294495 -1.633268
H  1.812861 -1.717617 -1.749458
H  -0.567382 4.079176 1.865305
H  4.721037 -0.938032 2.25635
H  1.717437 3.788194 -1.82008
H  4.193938 -2.458336 -1.780502
H  0.591004 5.195248 -0.066942
H  5.663283 -2.090409 0.225215
H  -3.756622 0.686262 3.271106
H  -3.193021 -0.9986 2.963495
H  -4.887006 -0.50826 2.6012
