program: Gaussian 09
title: 000209510
version: EM64L-G09RevD.01
frameworkgroup: C1[X(C18H27NO)]
method: RPBEPBE
basis: SDD
operation: Freq
keyword: #p
keyword: freq=noraman
keyword: PBEPBE/SDD
title: #p freq=noraman PBEPBE/SDD
converged: NO YES NO NO
title: Mulliken charges:
elementType: O N C C C C C C C C C C C C C C C C C C H H H H H H H H H H H H H H H H H H H H H H H H H H H
charge: -0.452125 -0.264601 0.050238 -0.278109 -0.295335 -0.450572 -0.468205 -0.110302 -0.409646 -0.418076 -0.385695 -0.421860 0.467323 -0.482971 -0.375971 -0.392011 -0.446811 -0.261422 -0.234352 -0.247411 0.228224 0.209853 0.235355 0.214154 0.180440 0.208335 0.210472 0.231235 0.192741 0.191665 0.194637 0.192946 0.195145 0.188817 0.264506 0.198360 0.228467 0.219582 0.204522 0.224246 0.191369 0.235917 0.230549 0.330927 0.223600 0.224071 0.227778
chargesum: 0.00000
title: Mulliken charges with hydrogens summed into heavy atoms:
elementType: O N C C C C C C C C C C C C C C C C C C
charge: -0.121198 -0.000095 0.278462 -0.068256 -0.059980 -0.055978 -0.049399 0.120933 -0.025240 -0.030493 -0.001733 0.004967 0.467323 -0.058866 0.039644 -0.156093 -0.216261 -0.037822 -0.010281 -0.019633
polarizability: 1.81941989e+02 9.66382430e+00 2.18296400e+02 2.33563173e+00 3.85760244e-01 1.79979035e+02
1716.lowfreq: -14.5506 -8.0395 -0.0008 -0.0005 -0.0003 9.8689 33.9320 38.0699 50.3630
frequency: 33.8278 37.8633 50.2435 70.9443 71.8766 89.6700 134.6476 153.5841 169.8842 204.0616 220.6607 237.2440 248.5065 265.2552 283.1153 287.0239 324.6312 358.2415 391.3575 407.7580 424.0602 430.8725 454.4763 477.0958 491.5839 516.3689 550.3609 586.1454 617.9786 652.0931 689.0729 705.6048 709.3916 757.0038 779.5053 789.1101 801.6644 817.4142 841.3536 850.4043 853.7681 868.0543 877.2424 891.1306 898.7085 915.8505 917.7526 941.9422 958.5543 974.2516 981.0632 989.6033 992.5787 1017.4716 1029.3799 1038.8973 1050.8834 1054.3669 1066.2635 1069.1901 1076.2807 1080.5826 1109.0007 1113.8663 1116.1784 1141.5293 1163.3840 1169.5028 1171.5570 1190.5615 1191.2506 1198.3391 1217.8090 1234.3640 1239.8699 1256.9058 1260.2788 1270.3288 1272.4334 1287.0335 1309.9389 1312.6870 1316.4816 1330.9870 1333.6347 1336.4867 1339.0374 1339.8723 1340.3280 1349.6108 1354.0329 1363.9644 1370.2152 1384.3422 1390.4013 1439.4794 1450.6341 1455.0007 1461.1220 1461.8640 1462.9003 1464.2003 1468.5270 1469.7151 1476.9505 1482.1797 1587.8157 1610.4090 2952.9599 2956.8712 2961.7564 2963.5610 2963.7178 2967.8725 2975.3547 2976.6434 2978.8955 2982.6545 2985.9614 2996.4555 3011.8643 3021.7265 3023.2041 3028.0049 3038.2057 3039.9845 3046.7458 3059.3446 3113.2271 3118.4752 3132.8870 3141.9472 3160.8082 3421.9936 3556.9297
redmass: 3.4746 3.4496 3.8949 3.8503 4.0124 3.5554 3.1942 3.2670 3.7571 3.2087 1.9128 4.0429 2.9372 3.2843 1.2592 2.7492 1.8339 2.1595 2.4997 2.8295 2.5563 3.0763 2.3958 2.2369 2.6575 2.8377 2.8016 3.6624 5.8865 2.9113 2.2058 2.5811 1.5979 2.6876 2.2962 1.5189 2.7914 2.3844 2.2976 2.0086 1.2599 2.0775 2.5838 1.7202 1.5596 1.8435 1.5531 2.4445 2.5518 1.3961 2.4223 5.0845 1.3688 2.7611 2.2469 1.9345 1.8125 1.7810 1.2068 1.7314 1.8329 1.6065 2.3102 2.6936 1.6904 2.3753 1.3878 1.3971 1.0938 1.4266 1.3388 1.9192 1.3032 1.3184 1.3220 1.3077 1.3025 1.2929 1.2285 1.2628 1.5002 1.2989 1.3596 1.2533 1.3707 1.4598 1.3860 1.4011 1.3478 1.4341 1.4860 1.3314 1.8641 2.8758 1.5391 2.0836 1.0940 1.1163 1.0875 1.0902 1.0961 1.0915 1.1464 1.0955 1.0978 2.2302 5.8364 6.1111 1.0620 1.0749 1.0592 1.0638 1.0614 1.0662 1.0731 1.0715 1.0734 1.0775 1.0662 1.0774 1.0981 1.0950 1.1011 1.1033 1.0989 1.1032 1.0997 1.1026 1.0865 1.0859 1.0910 1.0958 1.1013 1.0737 1.0662
irintensity: 0.0949 0.0340 0.0807 0.1056 0.2394 0.4305 2.3439 4.5407 1.7280 4.2080 0.1210 1.0748 4.2201 0.2537 128.7689 4.8973 0.1968 8.0887 11.3506 0.0399 3.3251 0.0554 0.6377 4.5588 4.1754 5.5882 14.5041 21.2086 4.7163 18.2109 59.3207 51.8924 48.2989 15.9772 15.4483 0.3404 0.9664 0.3801 3.7039 23.5715 0.5759 5.2374 5.1032 6.0357 15.5510 3.3641 10.5427 50.0159 3.1154 0.1899 9.4656 0.0920 0.0382 0.8923 10.8083 5.9796 0.4134 6.8729 0.7950 14.3937 20.7600 6.4885 15.3983 5.0868 4.7197 0.1335 10.3205 8.8705 1.8573 8.7842 2.3843 2.9778 56.5668 6.8047 0.6656 5.3039 2.0054 0.0590 7.9802 2.2530 3.9164 5.1118 5.9790 1.8295 0.3781 5.9504 2.0304 0.6320 1.1453 0.7452 0.7356 6.5687 2.5914 0.4137 3.5145 9.8749 9.1834 7.8897 6.2282 1.5062 9.2592 9.7196 6.1602 21.3310 2.8774 15.9055 1.9031 9.6603 25.9823 8.2144 36.2843 48.3276 44.0478 15.8637 24.3637 16.7766 13.4918 20.5683 104.0193 55.4386 76.2832 68.7401 41.1757 3.9162 50.9919 133.3509 33.4898 60.2868 9.3098 2.7205 14.3844 43.2105 24.7187 0.6593 4.7733
temp: 298.150 k
press: 1.00000 atm
elementType: 8 7 6 6 6 6 6 6 6 6 6 6 6 6 6 6 6 6 6 6 1 1 1 1 1 1 1 1 1 1 1 1 1 1 1 1 1 1 1 1 1 1 1 1 1 1 1
symmnumber: 1
zpe: 1089623.6 jmol-1
zpe.correction: 0.415016 hartree
zpe.thermalcorrener: 0.433909 hartree
zpe.thermalcorrenthalpy: 0.434853 hartree
zpe.thermalcorrgfe: 0.367774 hartree
zpe.sumelectzpe: -830.534683 hartree
zpe.sumelectthermal: -830.515789 hartree
zpe.sumelectthermalent: -830.514845 hartree
zpe.sumelectthermalfe: -830.581924 hartree
dipole: 0.2319 0.8076 0.0662
dipole: 0.8429
quadrupole: -132.1772 -118.6845 -113.3298
quadrupole: 2.5343 1.1860 2.1665
quadrupole: -10.7800 2.7126 8.0674 2.5343 1.1860 2.1665
hfenergy: -830.9496982 hartree
pointgroup: C01 [X(C18H27N1O1)]
dipole: -0.124241 -0.3064442 0.0249661 debye
polarizability: 184.3212188|13.3465807|215.8178313|-2.2927721|0.0207544|180.0783742 unknown
InChI: InChI=1S/C18H27NO/c20-16-12-7-13-19-18(16)17(14-8-3-1-4-9-14)15-10-5-2-6-11-15/h1,3-4,8-9,15-20H,2,5-7,10-13H2
charge 0 multiplicity 1
47 atoms
O  3.604454 -0.429696 1.379821
N  1.813119 1.849172 0.581925
C  -0.96537 1.223954 -0.115073
C  0.160248 0.147043 -0.3076
C  1.396796 0.420196 0.616401
C  -2.075097 1.090733 -1.189342
C  -1.598301 1.26741 1.298435
C  2.591669 -0.533105 0.2955
C  -3.111886 2.234969 -1.082369
C  -2.622357 2.422776 1.413264
C  -3.726906 2.305883 0.336023
C  3.326272 -0.140502 -0.999428
C  -0.341464 -1.294628 -0.173302
C  2.513211 2.24482 -0.671145
C  3.737551 1.350731 -0.994787
C  -0.596716 -1.899562 1.088436
C  -0.582151 -2.071895 -1.337113
C  -1.072695 -3.226293 1.180494
C  -1.059835 -3.39902 -1.252543
C  -1.307303 -3.984474 0.010088
H  -0.456556 2.199961 -0.258244
H  0.494425 0.267674 -1.359988
H  1.088652 0.217831 1.663022
H  -2.592388 0.116515 -1.071719
H  -1.621009 1.088807 -2.202244
H  -0.808868 1.398017 2.063779
H  -2.115559 0.309324 1.508703
H  2.231842 -1.579601 0.22609
H  -3.909409 2.096937 -1.839019
H  -2.615749 3.201302 -1.311045
H  -2.093422 3.390585 1.290304
H  -3.074485 2.430176 2.424755
H  -4.427753 3.160693 0.40818
H  -4.319871 1.386056 0.521953
H  2.418961 2.042039 1.393254
H  2.66165 -0.34902 -1.861624
H  4.213198 -0.790624 -1.108061
H  2.817003 3.303252 -0.571035
H  1.785837 2.199586 -1.506077
H  4.51798 1.506984 -0.226225
H  4.170813 1.631677 -1.974859
H  -0.422297 -1.334049 2.010888
H  -0.389611 -1.628663 -2.322369
H  3.230754 -0.848742 2.196247
H  -1.261258 -3.668528 2.165751
H  -1.234924 -3.975131 -2.16846
H  -1.674397 -5.014466 0.081157
