program: Gaussian 09
title: 000209486
version: EM64L-G09RevD.01
frameworkgroup: C1[X(C19H24N2S)]
method: RPBEPBE
basis: SDD
operation: Freq
keyword: #p
keyword: freq=noraman
keyword: PBEPBE/SDD
title: #p freq=noraman PBEPBE/SDD
converged: YES YES NO NO
title: Mulliken charges:
elementType: S N N C C C C C C C C C C C C C C C C C C C H H H H H H H H H H H H H H H H H H H H H H H H
charge: 0.197407 -0.104993 -0.306339 -0.380323 -0.367216 0.477136 -0.484518 -0.589944 0.447636 -0.322164 -0.327629 0.439835 -0.358272 -0.430309 -0.408999 -0.228677 -0.672120 -0.673015 -0.375399 -0.301712 -0.240085 -0.239579 0.177922 0.225258 0.229038 0.183447 0.236808 0.206474 0.250115 0.203461 0.185848 0.205828 0.187082 0.281488 0.233024 0.225031 0.211335 0.227167 0.205333 0.227766 0.207775 0.205665 0.232852 0.243902 0.227193 0.229466
chargesum: 0.00000
title: Mulliken charges with hydrogens summed into heavy atoms:
elementType: S N N C C C C C C C C C C C C C C C C C C C
charge: 0.197407 -0.104993 -0.056224 0.022857 0.045270 0.477136 -0.041236 -0.589944 0.447636 0.067145 0.065281 0.439835 -0.358272 -0.148821 -0.175974 -0.003646 -0.028285 -0.031809 -0.142548 -0.057810 -0.012892 -0.010113
polarizability: 3.57967476e+02 2.51290587e+01 2.48468308e+02 6.79422319e+00 -1.35968301e+01 1.34862849e+02
1716.lowfreq: -9.1919 -2.9303 0.0011 0.0013 0.0013 2.2322 13.7591 14.8486 28.7165
frequency: 12.9444 14.5927 28.6509 45.4245 65.2413 80.7003 90.4112 109.1580 113.2204 129.1926 141.1851 155.1947 192.5733 197.7768 221.2745 232.2635 255.4041 277.4556 280.8395 290.7850 319.8654 372.0849 399.7505 411.0262 429.9690 439.5527 453.4976 480.7941 493.3756 497.2170 509.6547 548.8812 579.8350 610.7125 669.6012 679.1854 694.5617 728.9412 737.8890 745.5783 746.5416 764.1606 792.7908 794.0204 804.0438 809.2305 865.0706 869.1673 913.0947 917.7709 945.3787 966.3116 982.0191 982.8102 990.0532 1014.3851 1021.0555 1029.1503 1036.5709 1052.2833 1074.5018 1078.9448 1084.4793 1086.6139 1089.4495 1094.7327 1127.4028 1131.1746 1148.2775 1161.8333 1171.9802 1179.8028 1206.1002 1218.0835 1241.5861 1254.6788 1259.4626 1276.3306 1285.8123 1293.6756 1308.4598 1323.3984 1347.6498 1360.6803 1366.5126 1374.3547 1383.8128 1386.0954 1386.7569 1391.3142 1418.0130 1435.9950 1446.0160 1448.9900 1459.5670 1462.2588 1467.8937 1469.6185 1475.2227 1478.9355 1481.8664 1485.3223 1488.8398 1493.0252 1572.2915 1586.5091 1594.6373 1606.9847 2836.8767 2842.4236 2845.9761 2859.1964 2871.5586 2977.1379 2981.9073 2983.2198 3023.5413 3027.0785 3031.4617 3056.1331 3074.3857 3076.0423 3091.3164 3091.7858 3127.6679 3129.2870 3138.8404 3145.8791 3152.4350 3162.0958 3167.5564 3426.8156
redmass: 3.7811 4.3632 4.4062 3.7492 2.8118 2.0529 3.6505 2.5440 3.5320 2.8617 2.8847 2.2770 2.0712 2.8987 1.3278 3.4311 3.3127 3.7334 2.1368 2.5043 2.6209 3.9786 7.8283 3.8563 3.0358 4.5496 2.9336 8.2476 3.2011 3.9167 3.6950 4.8180 3.6675 6.0734 5.8060 6.4453 1.3382 4.0357 1.7957 2.5347 6.0943 1.4044 1.1807 1.1327 1.2498 1.7030 1.4273 4.4653 1.7862 1.4402 1.3955 1.7589 1.6137 1.7582 1.5365 4.8560 2.3826 2.4527 4.3018 2.7069 1.9438 2.1834 2.1346 2.3346 2.1587 2.2502 1.8537 1.5895 2.6764 1.4526 1.0893 1.2276 2.2258 1.6098 1.9730 1.4589 1.4037 1.1300 1.2038 1.2075 1.3340 2.2676 1.5065 1.3439 1.3988 3.4707 3.5807 1.2328 1.2897 1.7524 2.9586 2.4127 2.6654 1.2404 1.0582 1.0566 1.1515 1.1189 1.1757 1.0958 1.9008 1.0653 1.0724 1.0882 6.5489 6.8111 7.3468 6.7932 1.0717 1.0719 1.0720 1.0711 1.0709 1.0844 1.0357 1.0357 1.0872 1.0862 1.0875 1.0900 1.0984 1.0981 1.1003 1.1004 1.0861 1.0855 1.0892 1.0919 1.0949 1.0981 1.1005 1.0740
irintensity: 0.0267 0.1231 0.1183 0.0374 0.0897 0.3414 1.9155 3.0274 0.0784 2.4230 1.3175 0.3916 1.2244 0.4905 0.2261 5.1049 2.6663 2.1469 0.6230 0.6530 0.0952 0.9876 0.8747 3.5455 5.0164 5.6363 5.9965 0.5413 2.7763 4.1327 1.4376 7.8690 2.5225 3.3865 1.1595 7.9102 70.4933 2.3648 11.3309 12.2657 2.0307 123.0893 6.3401 5.4019 6.4730 20.3369 0.0183 1.6020 4.1368 0.7587 1.5657 12.2950 3.9571 4.9696 1.1169 54.9074 1.6256 3.2281 15.7508 14.0237 20.2714 34.5363 1.5829 8.4160 11.9306 9.1642 28.1417 4.2126 73.0885 5.1977 0.9898 2.1798 32.5260 20.4202 6.1276 13.3861 8.4504 1.7975 29.9885 19.6549 6.1338 2.0041 4.2834 3.4844 10.7949 6.0364 3.0912 23.1476 24.3244 2.9014 22.2465 46.8636 1.8272 58.0459 1.0583 5.9525 8.5428 10.1899 0.3413 12.9795 1.8319 7.9378 17.6974 3.5611 1.7724 16.2724 2.3989 0.4127 69.7250 73.8349 38.0081 235.3498 113.6181 17.4777 33.9554 31.8833 16.7181 20.2279 22.9815 33.5604 43.6231 81.3138 32.5726 51.4631 5.7851 0.5332 3.6408 7.7849 22.1979 22.4597 33.1133 0.9271
temp: 298.150 k
press: 1.00000 atm
elementType: 16 7 7 6 6 6 6 6 6 6 6 6 6 6 6 6 6 6 6 6 6 6 1 1 1 1 1 1 1 1 1 1 1 1 1 1 1 1 1 1 1 1 1 1 1 1
symmnumber: 1
zpe: 1011554.7 jmol-1
zpe.correction: 0.385281 hartree
zpe.thermalcorrener: 0.407276 hartree
zpe.thermalcorrenthalpy: 0.408220 hartree
zpe.thermalcorrgfe: 0.331051 hartree
zpe.sumelectzpe: -1244.349714 hartree
zpe.sumelectthermal: -1244.327719 hartree
zpe.sumelectthermalent: -1244.326775 hartree
zpe.sumelectthermalfe: -1244.403944 hartree
dipole: 0.5883 0.2070 -1.2607
dipole: 1.4065
quadrupole: -119.0557 -131.9733 -144.4960
quadrupole: 0.0292 -2.9020 -1.9008
quadrupole: 12.7860 -0.1317 -12.6543 0.0292 -2.9020 -1.9008
hfenergy: -1244.734995 hartree
pointgroup: C01 [X(C19H24N2S1)]
dipole: -0.2047645 0.1841313 -0.4799898 debye
polarizability: 355.5852515|23.909487|206.62914|17.5200998|58.4180566|179.0842414 unknown
InChI: InChI=1S/C19H24N2S/c1-3-21(4-2)13-12-20-14-15-8-7-10-17-16-9-5-6-11-18(16)22-19(15)17/h5-11,20H,3-4,12-14H2,1-2H3
charge 0 multiplicity 1
46 atoms
S  2.188719 1.286099 1.359677
N  -5.621314 0.331226 -0.219864
N  -1.857653 -0.140201 -0.439841
C  -4.313649 -0.095971 -0.774699
C  -3.14792 0.227934 0.181806
C  0.588987 -0.545608 -0.188496
C  -0.677653 0.038592 0.426587
C  1.869476 -0.06986 0.172281
C  3.075239 -0.610268 -0.367309
C  -6.742131 -0.569283 -0.602358
C  -5.912505 1.767504 -0.47985
C  4.276461 0.047624 0.149505
C  3.981472 1.087605 1.082227
C  0.53638 -1.603712 -1.127116
C  2.986438 -1.668935 -1.305991
C  1.719671 -2.15816 -1.678723
C  -6.728464 -1.902193 0.169875
C  -6.864772 2.387862 0.560455
C  5.634658 -0.220094 -0.158852
C  4.991791 1.849071 1.700806
C  6.655537 0.534339 0.452282
C  6.337281 1.56411 1.377345
H  -4.117228 0.371119 -1.775355
H  -4.322322 -1.187458 -0.93869
H  -3.278475 -0.36545 1.105782
H  -3.195695 1.303745 0.484231
H  -0.889199 -0.478739 1.385403
H  -0.488264 1.109475 0.696094
H  -1.727616 0.319864 -1.352434
H  -7.687969 -0.043612 -0.376934
H  -6.747521 -0.769671 -1.704479
H  -4.952433 2.315501 -0.445786
H  -6.325438 1.919303 -1.51041
H  -0.451565 -1.98064 -1.41025
H  3.896649 -2.098827 -1.73869
H  1.644764 -2.977142 -2.402445
H  -5.806189 -2.480024 -0.022352
H  -6.78917 -1.711655 1.255454
H  -7.586946 -2.532388 -0.129729
H  -6.437201 2.283382 1.57271
H  -7.855269 1.897931 0.558131
H  -7.023184 3.462006 0.348636
H  5.888075 -1.01339 -0.871004
H  4.746966 2.642428 2.414217
H  7.70388 0.325853 0.213116
H  7.139697 2.144107 1.846036
