program: Gaussian 09
title: 000209480
version: EM64L-G09RevD.01
frameworkgroup: C1[X(C18H21NO2)]
method: RPBEPBE
basis: SDD
operation: Freq
keyword: #p
keyword: freq=noraman
keyword: PBEPBE/SDD
title: #p freq=noraman PBEPBE/SDD
converged: YES YES NO NO
title: Mulliken charges:
elementType: O O N C C C C C C C C C C C C C C C C C C H H H H H H H H H H H H H H H H H H H H H
charge: -0.455816 -0.483827 -0.389144 -0.201059 -0.107033 -0.020015 -0.431482 -0.402105 -0.416442 0.367794 0.400915 -0.374926 -0.381046 -0.411939 -0.412594 -0.250761 -0.225181 -0.229742 -0.261361 -0.241029 -0.243948 0.202477 0.266410 0.237856 0.193217 0.308753 0.208317 0.223454 0.188319 0.222415 0.363545 0.348810 0.243126 0.280961 0.301444 0.227679 0.223933 0.225010 0.225893 0.223835 0.227405 0.227883
chargesum: 0.00000
title: Mulliken charges with hydrogens summed into heavy atoms:
elementType: O O N C C C C C C C C C C C C C C C C C C
charge: -0.092271 -0.135016 -0.080391 0.001418 0.159377 -0.020015 -0.000409 0.029666 -0.005708 0.367794 0.400915 -0.131801 -0.100085 -0.110495 -0.184915 -0.026828 -0.000171 -0.003849 -0.037526 -0.013624 -0.016065
polarizability: 1.91050625e+02 -7.24080311e+00 2.21614302e+02 2.37010515e-01 1.07222660e+01 1.79293213e+02
1716.lowfreq: -12.2479 -0.0005 -0.0002 0.0003 6.8321 10.1366 39.3932 44.8629 58.1107
frequency: 39.2574 44.7355 58.0940 61.6200 72.7918 102.9308 161.2685 184.8240 213.3609 237.7355 243.8004 265.7774 276.9900 300.8112 319.2703 342.0991 360.2516 382.4995 404.1825 405.1556 458.9494 485.7196 503.2411 517.8391 550.0875 574.1503 615.7808 616.8891 631.2995 656.3967 685.3109 705.6898 709.8405 732.9624 757.0069 758.2885 794.7603 818.6907 851.6842 854.9059 858.6996 860.2629 880.3569 899.9680 907.5324 929.7413 935.1222 953.8695 966.0284 980.6493 983.3575 986.6815 989.2227 991.0492 1000.0106 1003.7952 1027.6211 1029.4015 1048.0577 1064.9993 1076.1925 1079.6287 1091.8125 1119.3669 1131.6386 1161.9662 1170.3988 1172.0501 1178.5115 1181.9776 1190.3119 1193.5985 1206.6565 1224.4338 1253.5510 1286.7876 1301.4635 1308.7860 1315.9212 1337.2252 1340.8491 1348.5382 1353.9180 1376.1790 1379.9395 1387.4892 1415.3530 1430.9770 1432.1316 1436.3381 1454.7108 1468.2682 1474.1219 1476.6159 1479.0442 1587.3817 1590.1605 1606.7883 1610.9795 2880.6414 2920.2190 2977.8641 2995.0966 3046.8900 3051.2244 3061.8605 3078.8529 3113.7250 3120.6673 3126.2017 3129.6556 3138.0642 3142.4104 3155.7419 3158.0740 3169.6696 3174.6835 3195.2349 3258.6889 3454.0634
redmass: 3.9942 4.0559 4.3805 4.4700 4.3078 4.0327 3.5506 3.8369 4.0936 5.1428 4.5227 5.0650 3.1772 4.0053 4.2044 2.9928 4.6822 2.6696 2.8763 2.8726 4.4724 3.1846 2.7731 2.8342 2.9952 1.3407 6.3085 6.3547 5.8826 3.8378 2.1446 1.8762 1.7767 1.6966 2.2493 1.7967 3.2531 3.9091 2.0414 1.6463 1.5991 1.2962 1.9110 1.7952 1.8583 1.5609 1.5785 2.7114 2.6229 1.3795 1.3867 2.8354 5.9797 4.1355 1.3320 1.3294 2.1922 2.1449 2.3493 2.0102 1.6302 1.6174 1.7363 2.7506 2.8576 2.1103 1.1051 1.1528 1.3460 1.3985 1.2110 1.4256 1.7810 1.5206 1.2045 1.3043 1.3663 1.3561 1.3586 1.2878 1.4623 1.4605 1.4074 6.1065 6.9596 1.2070 1.4093 2.0432 1.3914 2.0568 1.0885 1.0889 1.0919 2.1815 2.1958 6.0648 6.2188 6.0580 6.0620 1.0709 1.0809 1.0642 1.0616 1.0904 1.0976 1.1021 1.0877 1.0856 1.0844 1.0872 1.0881 1.0932 1.0938 1.0971 1.0987 1.0973 1.0953 1.0643 1.0662 1.0757
irintensity: 0.0479 0.5827 0.9490 0.4916 0.2333 2.0047 4.0426 1.3865 0.2858 6.7326 1.2184 1.0659 2.5168 4.2579 6.4352 3.6741 13.4803 4.8521 0.3008 0.1397 2.2208 10.1219 9.5029 26.7212 4.2130 246.2249 0.6092 0.5458 17.5326 13.5502 36.4686 42.8861 61.3889 35.2380 42.5709 33.3862 5.8462 38.6896 19.3648 2.4329 2.4034 2.3772 5.9355 53.2392 7.4648 3.8125 16.7596 3.7385 28.2963 1.4696 0.1065 29.2215 0.5008 7.7595 0.8480 1.2322 7.3225 13.0329 2.8540 23.7343 4.4739 4.3097 10.0924 14.0291 26.7854 21.4120 3.3285 2.4655 26.7631 9.6917 0.7836 1.4030 18.4664 11.8249 3.1354 6.5231 27.7473 1.7536 2.1767 1.9082 3.4088 2.4534 22.4233 2.2437 1.9989 68.0356 52.4797 7.8329 25.4497 50.6069 14.2995 12.0792 6.8339 28.9206 12.5554 0.4800 0.6421 10.3248 2.1039 75.9521 38.6393 32.3578 31.2929 51.4904 31.1381 42.3927 29.9530 9.4909 1.0872 2.2737 8.0201 31.9724 33.3987 26.6631 26.1623 14.7023 10.5727 69.4969 302.1898 16.3608
temp: 298.150 k
press: 1.00000 atm
elementType: 8 8 7 6 6 6 6 6 6 6 6 6 6 6 6 6 6 6 6 6 6 1 1 1 1 1 1 1 1 1 1 1 1 1 1 1 1 1 1 1 1 1
symmnumber: 1
zpe: 921333.7 jmol-1
zpe.correction: 0.350917 hartree
zpe.thermalcorrener: 0.368839 hartree
zpe.thermalcorrenthalpy: 0.369783 hartree
zpe.thermalcorrgfe: 0.305027 hartree
zpe.sumelectzpe: -902.161629 hartree
zpe.sumelectthermal: -902.143708 hartree
zpe.sumelectthermalent: -902.142764 hartree
zpe.sumelectthermalfe: -902.207519 hartree
dipole: -1.2125 0.9618 -3.3820
dipole: 3.7193
quadrupole: -119.8867 -117.7752 -122.6154
quadrupole: -5.2288 4.2321 4.6384
quadrupole: 0.2057 2.3172 -2.5230 -5.2288 4.2321 4.6384
hfenergy: -902.5125465 hartree
pointgroup: C01 [X(C18H21N1O2)]
dipole: 0.4419077 -0.5123426 -1.2974774 debye
polarizability: 189.6130366|-1.5070189|222.1238559|-1.7063888|-12.490524|180.221248 unknown
InChI: InChI=1S/C18H21NO2/c20-16-12-7-13-19-17(16)18(21,14-8-3-1-4-9-14)15-10-5-2-6-11-15/h1-6,8-11,16-17,19-21H,7,12-13H2
charge 0 multiplicity 1
42 atoms
O  2.601678 0.877655 1.650088
O  0.021271 0.084226 1.997658
N  1.969023 -1.334883 0.282506
C  1.269727 -0.097108 -0.147665
C  2.278589 1.037348 0.207147
C  -0.134926 0.053916 0.538728
C  3.550069 0.882144 -0.658791
C  4.178522 -0.527378 -0.488492
C  3.115537 -1.646293 -0.609321
C  -0.994963 -1.190624 0.209161
C  -0.859021 1.344815 0.073037
C  -1.493613 -1.401502 -1.102079
C  -1.762953 1.957622 0.97809
C  -1.265902 -2.155335 1.210487
C  -0.701695 1.917819 -1.215599
C  -2.237033 -2.561463 -1.409565
C  -2.490718 3.10806 0.607599
C  -2.017592 -3.313635 0.903581
C  -1.425112 3.074787 -1.586593
C  -2.501649 -3.524599 -0.407205
C  -2.325372 3.674035 -0.678267
H  1.106645 -0.101282 -1.24944
H  1.835138 2.040104 0.105324
H  4.281538 1.661534 -0.37945
H  3.274423 1.051304 -1.720231
H  1.326064 -2.122632 0.436224
H  4.97139 -0.683191 -1.24361
H  4.659836 -0.594914 0.505705
H  2.788613 -1.732566 -1.674641
H  3.550037 -2.61691 -0.310101
H  2.711177 -0.127381 1.722196
H  0.866333 0.59756 2.190445
H  -1.325886 -0.64995 -1.881776
H  -1.87101 1.521082 1.975382
H  -0.8962 -1.967628 2.222176
H  -0.01006 1.479804 -1.94479
H  -2.618676 -2.708891 -2.426369
H  -3.185147 3.564985 1.321977
H  -2.226468 -4.048416 1.68974
H  -1.283479 3.505942 -2.58439
H  -3.084372 -4.421911 -0.644632
H  -2.887366 4.569645 -0.966244
