program: Gaussian 09
title: 000209465
version: EM64L-G09RevD.01
frameworkgroup: C1[X(C12H24N2O2)]
method: RPBEPBE
basis: SDD
operation: Freq
keyword: #p
keyword: freq=noraman
keyword: PBEPBE/SDD
title: #p freq=noraman PBEPBE/SDD
converged: YES YES NO NO
title: Mulliken charges:
elementType: O O N N C C C C C C C C C C C C H H H H H H H H H H H H H H H H H H H H H H H H
charge: -0.193826 -0.193825 -0.276515 -0.276514 -0.381064 -0.381066 -0.369058 -0.369057 -0.348743 -0.348743 -0.385489 -0.385488 -0.432009 -0.432009 -0.065202 -0.065202 0.214411 0.177493 0.177492 0.214412 0.205191 0.178445 0.205191 0.178444 0.238923 0.238923 0.201843 0.167965 0.167965 0.201843 0.205428 0.235648 0.235648 0.205428 0.230170 0.226615 0.226614 0.230171 0.169774 0.169773
chargesum: 0.00000
title: Mulliken charges with hydrogens summed into heavy atoms:
elementType: O O N N C C C C C C C C C C C C
charge: -0.193826 -0.193825 -0.037592 -0.037592 0.010840 0.010838 0.014578 0.014578 0.021065 0.021065 0.055587 0.055587 0.024776 0.024777 0.104572 0.104571
polarizability: 2.08856242e+02 -1.21791641e+00 1.40824994e+02 1.93218443e-01 -1.25971483e+00 1.09288273e+02
1716.lowfreq: -12.0014 -0.0011 0.0010 0.0017 1.4198 8.4652 10.9863 20.7105 28.0530
frequency: 8.4652 20.7105 28.0530 34.0887 49.4678 56.4712 59.2510 82.9349 97.8654 109.0523 125.2969 131.7777 134.5640 144.7720 160.9625 170.4035 171.1596 186.0862 212.5236 296.1118 304.5044 396.7409 424.3245 476.1972 519.7308 658.4775 659.3598 664.0739 664.2688 689.8307 694.2577 747.3432 779.3395 780.3908 804.9522 892.2214 892.7123 908.1404 910.8102 928.4515 1000.5566 1007.5745 1039.7289 1046.2019 1069.0555 1072.9442 1080.6560 1088.4506 1090.3515 1097.1610 1111.7749 1135.0321 1141.5439 1150.6511 1151.2951 1193.3344 1204.8564 1234.5637 1239.4622 1255.7026 1256.3359 1269.0126 1271.0142 1274.5997 1274.9240 1279.6399 1287.4058 1312.3540 1329.6683 1342.8642 1358.3972 1364.1317 1379.2866 1379.3072 1394.2124 1395.6430 1427.6864 1427.7126 1450.7819 1452.5737 1467.9400 1470.0462 1471.5423 1474.7706 1487.0506 1489.7867 1498.1678 1499.8469 1646.5828 1646.6391 2825.8224 2826.0471 2842.7950 2843.5230 2850.6591 2850.7629 2947.0543 2947.0968 2955.1530 2963.5052 2980.1266 2980.1320 2986.6271 2986.6391 2989.0322 2990.6049 2998.8342 2998.8850 3019.8967 3047.8951 3065.3519 3065.3863 3420.9702 3420.9879
redmass: 6.1839 6.0015 3.1054 2.9499 2.9235 6.1058 2.0424 2.8175 1.8909 5.1472 2.2967 2.0104 6.4442 2.3886 2.3593 1.7616 1.7725 4.2022 5.4345 4.1974 3.9750 3.8842 3.8915 3.4605 3.4147 1.5134 1.7239 1.2246 1.1789 2.7727 2.4146 1.0725 1.1505 1.1558 1.1633 2.7073 2.8746 1.3017 1.2887 1.2591 3.5109 3.6411 2.7235 3.1264 2.3944 2.3986 2.0059 1.8386 3.0448 1.5466 2.8162 1.5741 1.2627 4.2763 3.9647 1.7155 1.4318 1.2752 1.3184 1.2873 1.2477 1.2753 1.4214 1.0792 1.0824 1.0529 1.1295 1.3117 1.4360 1.5530 1.5326 1.5942 1.2266 1.2340 1.5449 1.4859 1.1050 1.1049 1.2127 1.2122 1.0690 1.0804 1.0799 1.0854 1.0950 1.0952 1.0836 1.0877 7.5041 7.5051 1.0717 1.0717 1.0717 1.0709 1.0838 1.0838 1.0623 1.0624 1.0651 1.0655 1.0837 1.0837 1.0946 1.0946 1.0850 1.0819 1.0653 1.0653 1.0966 1.1015 1.1005 1.1005 1.0739 1.0740
irintensity: 2.3090 2.1972 15.5592 0.0000 0.0000 0.0000 2.2478 5.5962 0.0000 8.9389 0.0000 5.8285 0.0000 2.2610 0.0000 0.0001 2.7413 0.0000 10.8063 0.0000 6.3264 15.9719 0.0000 0.0000 7.5724 150.0099 0.0006 22.9182 0.0031 61.0432 0.0000 8.6806 0.0000 1.8150 0.0000 14.7107 0.0000 11.1327 0.0000 3.5038 0.0000 1.2445 3.2318 0.0000 0.0000 2.1703 0.0000 0.0000 5.3662 16.5993 0.0000 0.0000 28.6331 0.0002 111.5287 0.0000 6.9730 49.5250 0.0000 0.0000 4.2337 0.0000 24.1152 1.3011 0.0000 0.0000 1.2252 0.0000 80.0011 0.0000 5.5427 0.0000 12.1540 0.0007 0.0000 4.6360 67.1374 0.4962 75.8027 0.0000 0.0000 6.4831 0.0000 17.9595 0.0000 11.3622 0.0000 8.8617 250.3171 0.1266 181.5774 0.0049 0.0006 294.6260 326.0134 0.0031 86.6548 1.4740 0.0000 41.8008 16.4309 16.3733 1.3437 5.9664 0.0011 85.7878 0.0120 91.9158 0.0000 99.8881 0.0049 78.9647 3.1799 0.1351
temp: 298.150 k
press: 1.00000 atm
elementType: 8 8 7 7 6 6 6 6 6 6 6 6 6 6 6 6 1 1 1 1 1 1 1 1 1 1 1 1 1 1 1 1 1 1 1 1 1 1 1 1
symmnumber: 1
zpe: 911379.5 jmol-1
zpe.correction: 0.347126 hartree
zpe.thermalcorrener: 0.367841 hartree
zpe.thermalcorrenthalpy: 0.368785 hartree
zpe.thermalcorrgfe: 0.291835 hartree
zpe.sumelectzpe: -730.255947 hartree
zpe.sumelectthermal: -730.235233 hartree
zpe.sumelectthermalent: -730.234288 hartree
zpe.sumelectthermalfe: -730.311238 hartree
dipole: 0.0001 0.0000 -0.0002
dipole: 0.0002
quadrupole: -124.5813 -104.1354 -97.7601
quadrupole: 50.2786 4.9521 -3.1705
quadrupole: -15.7557 4.6902 11.0655 50.2786 4.9521 -3.1705
hfenergy: -730.6030732 hartree
pointgroup: C01 [X(C12H24N2O2)]
dipole: 0.0000215 0.0000102 -0.0000659 debye
polarizability: 208.858043|-0.7947649|140.4189236|1.0113046|-3.7303883|109.6925427 unknown
InChI: InChI=1S/C12H24N2O2/c15-11-5-3-9-13-7-1-2-8-14-10-4-6-12-16/h11-14H,1-10H2
charge 0 multiplicity 1
40 atoms
O  8.32446 -1.188131 0.193946
O  -8.322602 1.192963 -0.172724
N  3.162605 -0.088762 0.008678
N  -3.160735 0.0936 0.012577
C  0.68566 -0.354045 -0.007568
C  -0.683789 0.358884 0.028831
C  1.870642 0.629647 0.038547
C  -1.868772 -0.624807 -0.017303
C  4.357646 0.778247 0.020506
C  -4.355775 -0.773409 0.000687
C  5.648221 -0.062278 -0.010362
C  -5.646353 0.06711 0.03159
C  6.911175 0.816637 -0.02814
C  -6.909306 -0.811809 0.049271
C  8.22136 0.054232 0.058378
C  -8.219494 -0.049409 -0.037248
H  0.776687 -0.970557 -0.922861
H  0.756148 -1.053046 0.853492
H  -0.754273 1.057894 -0.832222
H  -0.774821 0.975387 0.944129
H  1.830461 1.294008 -0.848575
H  1.764037 1.293154 0.93613
H  -1.828592 -1.289185 0.869808
H  -1.762163 -1.288298 -0.914897
H  3.211159 -0.802208 0.750836
H  -3.209276 0.807076 -0.729552
H  4.315237 1.42816 -0.877752
H  4.386953 1.466661 0.906896
H  -4.385071 -1.461771 -0.885744
H  -4.313374 -1.423375 0.898908
H  5.68631 -0.732981 0.870854
H  5.631178 -0.721625 -0.896831
H  -5.629327 0.72639 0.918109
H  -5.684424 0.737877 -0.849578
H  6.951994 1.445926 -0.944044
H  6.903849 1.544978 0.813885
H  -6.901949 -1.540095 -0.792799
H  -6.950158 -1.441151 0.965136
H  9.139111 0.697856 -0.003508
H  -9.137239 -0.693044 0.024614
