program: Gaussian 09
title: 000209456
version: EM64L-G09RevD.01
frameworkgroup: C1[X(C8H5BrCl3NO)]
method: RPBEPBE
basis: SDD
operation: Freq
keyword: #p
keyword: freq=noraman
keyword: PBEPBE/SDD
title: #p freq=noraman PBEPBE/SDD
converged: NO YES NO NO
title: Mulliken charges:
elementType: Br Cl Cl Cl O N C C C C C C C C H H H H H
charge: -0.005302 -0.022108 0.010371 0.012153 -0.237973 -0.432007 0.692789 -0.421867 -0.269878 -0.094124 -0.200645 -0.120959 0.271017 -0.762069 0.339917 0.324887 0.285489 0.315188 0.315121
chargesum: 0.00000
title: Mulliken charges with hydrogens summed into heavy atoms:
elementType: Br Cl Cl Cl O N C C C C C C C C
charge: -0.005302 -0.022108 0.010371 0.012153 -0.237973 -0.107120 0.692789 -0.421867 0.070039 -0.094124 0.084844 -0.120959 0.271017 -0.131760
polarizability: 2.27876654e+02 1.04760546e+01 1.61876959e+02 1.34614609e-01 -2.10550454e-01 5.29599111e+01
1716.lowfreq: -4.7499 -4.4887 -0.0017 -0.0016 0.0020 1.4681 19.6537 48.4573 65.4399
frequency: 19.5360 48.4297 65.4397 66.5826 96.9304 116.0073 161.8628 179.4039 193.2724 240.1546 261.9117 307.8591 319.2577 365.1311 386.1223 447.8573 477.7105 497.2639 552.6651 571.7531 619.6069 648.5894 667.2886 701.1601 751.8109 766.3808 854.6649 872.1423 904.2746 920.3832 946.8966 1030.6233 1117.4180 1148.0381 1207.7973 1233.2221 1243.3302 1252.2867 1360.0889 1371.6572 1413.5937 1445.0126 1506.3478 1569.6739 1595.0341 1601.9711 3067.0216 3147.3482 3183.4607 3185.7555 3410.7914
redmass: 10.3352 9.0387 22.5494 3.9421 10.1479 25.1464 6.5045 28.8919 20.7056 5.6691 13.9632 18.7703 19.0927 8.2986 11.4206 3.2413 8.6025 6.9467 3.2739 7.1674 7.4006 5.8418 6.9346 2.9119 8.2741 1.2728 1.4230 1.7259 7.6685 1.4023 6.5220 5.5678 1.8797 1.1281 3.1165 1.2039 1.3854 2.8168 5.1982 10.3016 1.1020 2.8810 3.2032 4.1594 8.1946 6.6486 1.0567 1.1084 1.0927 1.0936 1.0770
irintensity: 0.7362 0.1235 0.3360 13.7164 1.1716 3.2009 0.0703 0.1684 1.0664 0.0930 1.1578 1.9943 0.4348 0.0022 36.6842 18.5386 4.7791 2.7650 0.1327 34.5635 0.3980 57.4789 55.0536 2.8499 24.6526 54.7673 13.1355 23.1250 13.2858 40.0774 5.6112 68.8766 21.8213 0.0437 28.8396 25.3556 26.9955 7.0368 105.5013 4.9151 33.0901 59.0558 653.4244 125.2672 156.2613 80.1147 1.7159 0.0202 23.6760 2.3562 104.3459
temp: 298.150 k
press: 1.00000 atm
elementType: 35 17 17 17 8 7 6 6 6 6 6 6 6 6 1 1 1 1 1
symmnumber: 1
zpe: 299777.1 jmol-1
zpe.correction: 0.114179 hartree
zpe.thermalcorrener: 0.128287 hartree
zpe.thermalcorrenthalpy: 0.129232 hartree
zpe.thermalcorrgfe: 0.069400 hartree
zpe.sumelectzpe: -1830.467279 hartree
zpe.sumelectthermal: -1830.453171 hartree
zpe.sumelectthermalent: -1830.452226 hartree
zpe.sumelectthermalfe: -1830.512058 hartree
dipole: 1.9369 1.3077 0.0095
dipole: 2.3370
quadrupole: -115.3056 -113.5957 -111.6645
quadrupole: -6.8500 0.0758 0.0283
quadrupole: -1.7837 -0.0738 1.8574 -6.8500 0.0758 0.0283
hfenergy: -1830.5814581 hartree
pointgroup: C01 [X(C8H5Br1Cl3N1O1)]
dipole: -0.5983101 -0.6908751 0.1005886 debye
dipolederiv: -0.4050418 -0.1191535 0.0002236 -0.3790227 -0.436946 0.0355228 0.0488502 0.0544736 -0.1089828 -0.2561428 -0.232952 0.0318441 -0.2313261 -0.5768266 0.0977288 0.0311754 0.0976287 -0.0472536 -0.203303 -0.2418793 0.036954 -0.3278248 -0.575478 0.0916918 0.0552723 0.0982237 -0.0368633 -0.8457999 -0.024868 -0.0557397 0.0110242 -0.0523651 0.0083836 -0.0627841 0.0056814 -0.0219486 -0.790085 -0.2980527 0.0241686 0.4920573 -0.9266706 0.1535011 -0.1295684 0.0961712 -0.3675915 -1.8389636 0.2226106 -0.1624217 0.5325663 -0.5705874 0.101635 -0.2243489 0.0791581 -0.2971077 1.1905208 -0.1553625 0.111636 0.0831306 -0.1289161 0.0586314 0.0630194 0.0406691 0.1243822 0.0914008 0.3551089 -0.0586713 0.4214467 0.8261346 -0.1678825 -0.0719643 -0.172257 -0.0935674 -0.3252571 -0.0469523 -0.0075163 -0.1703163 -0.2360422 0.0167553 0.0178821 0.0266947 -0.0991674 0.111806 0.4254665 -0.0767079 0.5065132 0.932475 -0.1674315 -0.0942577 -0.1734076 -0.0192647 -0.2590688 -0.0071604 -0.0159531 -0.1617057 -0.1433217 0.014329 0.016803 0.0251974 -0.0232593 1.0985371 -0.0951709 0.1053639 -0.0420581 -0.1611975 0.0160273 0.0934349 0.012318 -0.0654473 1.6263487 0.105932 0.0867705 -1.2734768 1.0042539 -0.256304 0.3575342 -0.1546842 0.2618392 -0.0476144 0.1035265 -0.0274299 0.5640866 0.7075798 -0.0800947 -0.1138372 -0.1150879 0.0749056 0.2204324 0.0326391 -0.0040936 -0.0214236 0.1090339 0.0148316 0.006142 0.0181465 0.1831591 0.4488406 0.0495746 0.0046674 0.0433075 0.2355148 0.0114473 0.0056132 0.0120984 0.2763644 0.0814813 0.0163842 -0.0099481 0.0247631 0.0476048 0.0272227 -0.0116917 0.0265316 0.1629249 0.0443785 -0.0389446 0.0289558 -0.0195186 -0.0427102 -0.0465889 0.0696864 -0.0095308 0.070059 0.0575305 -0.0507462 -0.0121024 -0.0522227 -0.0115352 0.0705941 -0.0569608 0.0319752 0.0268192 unknown
polarizability: 217.0986305|27.6007069|167.8026792|6.5955534|-21.3762095|57.8122151 unknown
InChI: InChI=1S/C8H5BrCl3NO/c9-3-8(14)13-7-2-5(11)4(10)1-6(7)12/h1-2,13H,3H2
charge 0 multiplicity 1
19 atoms
Br -4.383595 -1.776515 -0.100653
Cl -0.136318 -3.036028 0.508604
Cl 2.740427 2.623303 -0.460271
Cl 4.517995 -0.063063 0.230207
O  -2.188604 1.78748 -0.632728
N  -1.52595 -0.420339 -0.141446
C  -0.119624 -0.282106 -0.06531
C  0.674405 -1.423906 0.231684
C  0.54913 0.953499 -0.273194
C  1.951235 1.023789 -0.184109
C  2.071825 -1.358862 0.321595
C  2.719339 -0.123061 0.111519
C  -2.452648 0.567277 -0.408541
C  -3.932588 0.17697 -0.438315
H  -0.040984 1.842905 -0.502211
H  -1.897348 -1.367058 0.01957
H  2.655405 -2.253158 0.551505
H  -4.472334 0.744464 0.334572
H  -4.347869 0.411709 -1.429777
