program: Gaussian 09
title: 000209451
version: EM64L-G09RevD.01
frameworkgroup: C1[X(C13H21NO)]
method: RPBEPBE
basis: SDD
operation: Freq
keyword: #p
keyword: freq=noraman
keyword: PBEPBE/SDD
title: #p freq=noraman PBEPBE/SDD
converged: YES YES NO NO
title: Mulliken charges:
elementType: O N C C C C C C C C C C C C C H H H H H H H H H H H H H H H H H H H H H
charge: -0.272229 -0.110565 -0.402676 -0.324854 -0.329394 -0.294955 -0.670919 -0.670073 0.351668 -0.341897 -0.378417 0.440168 -0.422515 -0.332063 -0.810024 0.216342 0.221576 0.204827 0.190216 0.207744 0.191908 0.221574 0.204761 0.211241 0.226528 0.207008 0.208549 0.225338 0.207809 0.247282 0.245721 0.225308 0.227945 0.227575 0.227390 0.222104
chargesum: 0.00000
title: Mulliken charges with hydrogens summed into heavy atoms:
elementType: O N C C C C C C C C C C C C C
charge: -0.272229 -0.110565 0.035241 0.070189 0.070258 0.131380 -0.026142 -0.028377 0.351668 -0.094615 -0.132696 0.440168 -0.197206 -0.104118 -0.132956
polarizability: 2.14325431e+02 2.29725223e+00 1.31032666e+02 9.30895510e-01 1.56682212e+01 1.19746425e+02
1716.lowfreq: -4.7491 -0.0008 -0.0006 -0.0003 0.8286 16.1971 23.5470 35.6747 50.4243
frequency: 23.1081 35.6258 50.4076 52.9611 66.1496 94.9743 95.9709 139.6149 158.8207 181.6416 187.5290 229.9697 253.7998 292.0346 310.5429 328.0337 331.6118 387.5480 415.6260 430.8362 460.7269 495.9545 509.0438 530.9309 634.3781 711.9095 715.4472 758.6012 795.0824 796.7078 804.6020 819.3414 827.2935 830.0148 915.8144 931.9100 962.2142 972.2023 987.1224 989.8944 1005.1738 1047.3013 1062.2354 1064.5647 1075.9754 1085.2170 1094.6873 1119.8102 1123.6442 1163.4941 1178.9629 1208.3524 1217.3358 1225.8632 1236.7222 1280.3017 1288.1253 1290.5141 1304.6292 1329.6964 1361.5769 1366.6463 1371.6548 1386.9335 1389.1213 1391.3674 1398.9923 1414.7825 1460.3640 1464.1742 1469.0695 1471.1954 1472.4911 1477.1430 1480.5142 1486.3966 1487.3534 1492.2127 1503.1963 1585.7244 1626.3842 2856.0433 2864.7244 2915.4680 2960.9565 2972.0555 2982.7621 2983.8921 3020.0552 3025.8819 3034.1065 3048.0983 3063.6553 3075.7305 3077.1054 3080.2732 3091.0116 3091.6634 3121.0133 3123.5645 3160.4186 3164.2255
redmass: 3.6993 2.8858 3.2043 1.1811 3.1038 2.3639 2.0998 2.5601 3.7188 1.5194 2.0628 1.4656 1.9057 2.1372 2.4428 3.1989 3.2775 2.8639 2.9513 3.2442 2.8944 3.4483 2.4591 4.3873 6.7871 3.0059 4.1557 2.7979 1.2385 1.1306 1.4059 2.1306 1.7701 1.3956 1.8666 1.3245 1.3464 4.3304 1.6729 2.2478 2.6070 1.5223 2.5986 1.6881 1.9321 2.1398 2.8309 1.2583 1.7052 1.4017 1.2723 2.2668 2.0834 5.5317 1.6837 1.1222 1.2096 1.2283 1.2954 1.3343 1.3722 1.6115 2.5933 1.2366 1.2831 1.4152 1.2534 3.5551 1.0565 1.0519 1.0705 1.0457 1.0784 1.0976 1.0561 1.0701 1.0887 1.0797 2.4654 6.4719 6.4173 1.0719 1.0714 1.0703 1.0566 1.0373 1.0355 1.0358 1.0884 1.1022 1.0876 1.0978 1.0942 1.0985 1.0981 1.0982 1.1004 1.1003 1.0893 1.0891 1.0945 1.0944
irintensity: 0.3632 0.0403 0.2557 0.6501 0.6886 0.3255 0.3003 1.6290 0.9036 0.6857 0.9227 0.4740 1.5605 2.3973 1.0643 2.6332 4.0966 4.6348 0.0080 2.2794 3.5657 3.9337 20.6824 12.4471 0.5197 0.6519 16.3629 2.5556 13.2991 4.1383 26.1958 15.9973 28.0043 8.7803 0.2131 0.9710 0.4607 101.9600 9.9681 8.3105 6.1003 10.8641 31.3528 27.8603 17.6810 3.0090 11.3510 16.7486 6.9384 12.0115 65.6860 32.3856 121.4490 131.9758 23.6410 0.4673 10.4484 25.2092 1.0179 4.2754 2.2785 7.2709 0.5166 21.0701 14.7115 11.3458 10.2320 4.1099 3.1648 10.9520 3.3577 12.0031 26.1323 12.4001 13.0843 9.0174 28.5660 6.7592 147.7751 14.2614 39.4907 33.5215 176.0049 70.0391 42.5171 51.4776 33.4913 28.3041 18.0322 24.4192 17.9394 24.9692 37.6356 38.9115 84.1421 20.6205 32.9912 52.9401 18.2839 25.3535 17.0950 5.8162
temp: 298.150 k
press: 1.00000 atm
elementType: 8 7 6 6 6 6 6 6 6 6 6 6 6 6 6 1 1 1 1 1 1 1 1 1 1 1 1 1 1 1 1 1 1 1 1 1
symmnumber: 1
zpe: 820570.1 jmol-1
zpe.correction: 0.312539 hartree
zpe.thermalcorrener: 0.329632 hartree
zpe.thermalcorrenthalpy: 0.330576 hartree
zpe.thermalcorrgfe: 0.265765 hartree
zpe.sumelectzpe: -636.753425 hartree
zpe.sumelectthermal: -636.736332 hartree
zpe.sumelectthermalent: -636.735388 hartree
zpe.sumelectthermalfe: -636.800199 hartree
dipole: -1.1395 0.6572 0.1402
dipole: 1.3229
quadrupole: -80.0179 -91.5791 -93.4125
quadrupole: 1.0190 1.8937 2.0189
quadrupole: 8.3186 -3.2426 -5.0760 1.0190 1.8937 2.0189
hfenergy: -637.0659636 hartree
pointgroup: C01 [X(C13H21N1O1)]
dipole: -0.4494813 0.2567415 0.0540471 debye
polarizability: 214.2928241|2.426713|130.7839562|1.5863967|15.7813612|120.027741 unknown
InChI: InChI=1S/C13H21NO/c1-4-14(5-2)10-11-15-13-8-6-12(3)7-9-13/h6-9H,4-5,10-11H2,1-3H3
charge 0 multiplicity 1
36 atoms
O  0.256592 -0.769604 -0.65062
N  -3.344525 0.020836 -0.058232
C  -2.156077 -0.70443 -0.57308
C  -4.498247 -0.866587 0.24435
C  -3.704142 1.197165 -0.896698
C  -0.874327 -0.087356 0.00231
C  -4.296997 -1.68566 1.533384
C  -4.446875 2.294535 -0.110574
C  1.554617 -0.378191 -0.279927
C  1.850049 0.621318 0.677824
C  2.610754 -1.057807 -0.937632
C  4.271637 0.26512 0.320962
C  3.201788 0.929321 0.965052
C  3.946389 -0.735563 -0.636657
C  5.720259 0.60098 0.634363
H  -2.098134 -0.6944 -1.68617
H  -2.203011 -1.764266 -0.267525
H  -5.390576 -0.22691 0.370618
H  -4.720819 -1.554364 -0.610495
H  -2.764908 1.625203 -1.29523
H  -4.310519 0.892281 -1.78724
H  -0.838412 -0.237587 1.099265
H  -0.830453 1.001257 -0.208218
H  -3.417251 -2.35126 1.46368
H  -4.143862 -1.009316 2.392308
H  -5.181115 -2.319911 1.732365
H  -5.409437 1.932957 0.294165
H  -3.829866 2.637119 0.738368
H  -4.663669 3.159388 -0.765166
H  1.052862 1.158112 1.200471
H  2.360675 -1.827586 -1.674563
H  3.421197 1.705049 1.708992
H  4.754107 -1.269054 -1.153247
H  6.267165 -0.281581 1.017503
H  6.259514 0.950129 -0.266831
H  5.794221 1.396064 1.396524
