program: Gaussian 09
title: 000209638
version: EM64L-G09RevD.01
frameworkgroup: C1[X(C23H29N3O)]
method: RPBEPBE
basis: SDD
operation: Freq
keyword: #p
keyword: freq=noraman
keyword: PBEPBE/SDD
title: #p freq=noraman PBEPBE/SDD
converged: NO YES NO NO
title: Mulliken charges:
elementType: O N N N C C C C C C C C C C C C C C C C C C C C C C C H H H H H H H H H H H H H H H H H H H H H H H H H H H H H
charge: -0.283288 -0.105388 -0.439375 -0.361443 0.068636 -0.484132 -0.044040 -0.434562 -0.450156 -0.412469 -0.511767 -0.398527 -0.409494 -0.383140 0.212893 0.406130 0.266501 -0.367307 -0.343746 -0.341879 -0.357402 -0.224143 -0.206662 -0.223804 -0.210215 -0.256089 -0.242506 0.177676 0.247330 0.194930 0.288519 0.207921 0.190690 0.204945 0.205951 0.212837 0.221889 0.221624 0.240915 0.189685 0.198042 0.199692 0.193283 0.190086 0.197249 0.318105 0.254056 0.265990 0.276863 0.266580 0.222803 0.232287 0.224037 0.233675 0.226215 0.233499
chargesum: 0.00000
title: Mulliken charges with hydrogens summed into heavy atoms:
elementType: O N N N C C C C C C C C C C C C C C C C C C C C C C C
charge: -0.283288 -0.105388 -0.121270 -0.361443 0.246312 -0.041872 0.244479 -0.035951 -0.039259 0.022258 -0.049228 -0.010800 -0.016518 0.004196 0.212893 0.406130 0.266501 -0.113251 -0.077756 -0.065017 -0.090822 -0.001340 0.025625 0.000232 0.023460 -0.029875 -0.009007
polarizability: 3.27727258e+02 -1.08856010e+01 2.92843241e+02 -2.26350914e+00 -1.38733198e+01 2.02245097e+02
1716.lowfreq: -13.8790 -1.5862 -0.0007 0.0006 0.0007 3.5988 8.0640 16.0502 24.7728
frequency: -10.3566 15.6039 23.7731 27.9098 41.0527 48.8152 56.4584 69.5113 74.0385 82.0295 120.0677 122.3729 178.1778 199.1111 212.0414 230.2064 245.2598 265.6754 302.1249 305.4828 321.4285 346.0926 367.2787 398.3309 406.0613 408.7170 416.1004 429.1708 442.2963 450.2295 469.0567 501.9348 507.7276 515.0724 541.2756 593.0160 612.2713 615.2862 647.9383 659.1471 667.1667 693.0850 697.2649 702.7593 750.5249 758.5444 762.2801 781.9820 783.3015 801.4226 832.3827 836.7382 849.8710 854.4025 872.3279 886.7317 891.9912 902.4442 908.8354 920.4883 925.8798 928.6241 951.4155 964.6646 976.4851 977.5856 984.0745 986.8181 988.6494 994.6306 996.3158 1023.2093 1028.0324 1037.4617 1042.4819 1050.8729 1055.8707 1061.6509 1076.5053 1077.5408 1091.7406 1109.5889 1117.8459 1126.0301 1145.6713 1171.6865 1172.0624 1175.7967 1179.4514 1190.9482 1193.5336 1204.2406 1225.6780 1233.4855 1238.3934 1252.8328 1255.9562 1259.6928 1275.9078 1284.4155 1292.2522 1302.9523 1307.5029 1311.3963 1312.7428 1321.0663 1326.2667 1330.7154 1336.0672 1338.7106 1341.1049 1343.5938 1365.5704 1371.5098 1384.0387 1435.5699 1443.9538 1458.5169 1461.0246 1461.4201 1468.3818 1470.9902 1473.6847 1478.0945 1480.0374 1481.1141 1483.3989 1489.4205 1583.2071 1590.5620 1601.6186 1606.5369 1620.6945 2831.3193 2956.9472 2963.6351 2966.7797 2967.7406 2970.5479 2980.0122 2988.1481 3009.0258 3026.3933 3028.1250 3034.7340 3038.3891 3047.0066 3050.3751 3069.8463 3090.0220 3114.2970 3125.6001 3130.2405 3135.7084 3137.6686 3150.4720 3151.9387 3158.0210 3164.6815 3170.4140 3195.1254 3534.8150
redmass: 4.5542 4.0798 3.5859 4.2003 5.0417 3.7178 3.8319 3.5534 4.2136 4.7936 2.6051 4.3781 4.1516 3.5349 1.8846 3.7145 4.1920 4.2418 4.1490 2.4006 3.2919 2.7671 6.6683 2.5848 2.8825 2.9021 4.4123 3.0692 3.1110 2.9269 2.0347 1.7215 3.1775 3.4655 1.2765 4.6292 6.2558 6.3344 4.7731 3.8190 4.6269 1.9692 3.5155 3.0245 2.3956 2.1517 1.7659 1.5731 2.2939 2.0191 1.2526 2.8052 1.2534 1.7107 2.5159 2.2324 1.4971 1.4862 2.6903 2.1186 1.8846 2.2294 2.4610 1.3848 1.4975 2.7072 1.5477 3.5309 5.1814 1.7860 1.6744 2.2205 2.2223 2.3708 2.4130 1.5120 2.1049 1.5122 1.5550 1.7893 1.5857 2.8346 2.0980 2.4113 2.3288 1.0503 1.0529 1.4609 1.1336 1.2881 1.2056 1.4782 2.2090 3.0840 1.3611 1.3232 1.3553 1.2511 1.2627 3.5235 1.3232 1.2203 1.2864 1.4227 1.3108 1.4104 1.3534 1.3869 1.4180 1.5354 1.4674 1.4633 1.4586 7.1861 8.8673 2.2674 2.3864 1.0868 1.0885 1.0896 1.0859 1.0964 1.0850 2.3629 1.4536 1.1664 1.4012 1.7064 6.1514 6.4357 6.1487 6.7875 7.5198 1.0808 1.0722 1.0628 1.0606 1.0641 1.0612 1.0613 1.0678 1.0623 1.0973 1.0953 1.1008 1.1030 1.1031 1.0893 1.0967 1.0994 1.0919 1.0846 1.0850 1.0895 1.0884 1.0929 1.0938 1.0968 1.0998 1.1016 1.0948 1.0766
irintensity: 0.5070 0.2385 0.8690 0.8954 2.7279 0.2852 0.3765 1.2075 0.9582 2.1650 0.6312 0.7100 1.3814 3.7655 0.2174 0.4107 2.0082 7.9959 2.4436 1.1189 0.0216 0.0813 4.9992 6.2077 3.5341 1.5696 3.1899 0.7997 0.7949 3.2861 0.4524 1.5857 11.5261 20.6247 65.1522 40.9393 0.3167 1.5385 11.2787 11.9325 1.5007 34.5226 14.4520 54.4146 9.5654 15.6929 75.4667 0.2598 3.5804 5.0267 1.0438 1.8045 0.7849 23.3837 1.9856 2.7750 14.0739 2.5921 0.7852 3.1213 5.6685 10.0879 11.7486 0.4939 0.3184 2.6872 0.3713 0.5137 0.7440 0.4508 0.2442 2.2147 12.5806 39.9906 20.6883 1.2371 4.7744 11.4150 13.5841 24.9648 5.7369 2.3446 3.7019 16.2147 0.6780 0.2720 0.0435 23.6645 4.1571 2.5688 10.8457 13.0520 79.8765 380.6879 10.9537 0.4228 17.6300 1.7446 24.4225 143.7602 7.4382 17.8405 22.8487 30.2614 11.9900 6.0223 1.6956 9.7561 67.3082 0.5972 8.6393 6.1496 18.9693 1.9281 0.3004 5.1493 7.2648 5.2586 11.2968 8.5549 7.9848 19.4354 12.7275 74.5249 259.5137 91.3479 75.0756 203.5279 15.5023 1.0994 95.9667 64.0554 193.3549 52.6504 58.8983 38.7705 31.8961 39.8235 27.0780 18.2133 54.7572 44.4356 82.4827 80.4987 11.0741 4.0422 124.7666 7.9897 12.3491 58.3096 14.5212 1.8277 1.5991 14.7059 4.6130 24.1741 29.4960 17.6669 23.4340 13.2882 1.6984 16.8570
temp: 298.150 k
press: 1.00000 atm
elementType: 8 7 7 7 6 6 6 6 6 6 6 6 6 6 6 6 6 6 6 6 6 6 6 6 6 6 6 1 1 1 1 1 1 1 1 1 1 1 1 1 1 1 1 1 1 1 1 1 1 1 1 1 1 1 1 1
symmnumber: 1
zpe: 1248411.8 jmol-1
zpe.correction: 0.475495 hartree
zpe.thermalcorrener: 0.499125 hartree
zpe.thermalcorrenthalpy: 0.500069 hartree
zpe.thermalcorrgfe: 0.419618 hartree
zpe.sumelectzpe: -1131.333214 hartree
zpe.sumelectthermal: -1131.309584 hartree
zpe.sumelectthermalent: -1131.308640 hartree
zpe.sumelectthermalfe: -1131.389090 hartree
dipole: 0.3433 3.7161 0.7745
dipole: 3.8114
quadrupole: -151.8703 -157.1593 -156.1606
quadrupole: 10.8544 -1.6964 -2.4400
quadrupole: 3.1931 -2.0959 -1.0972 10.8544 -1.6964 -2.4400
hfenergy: -1131.8087086 hartree
pointgroup: C01 [X(C23H29N3O1)]
dipole: -0.0664753 0.9262725 -1.1773734 debye
polarizability: 328.3762106|2.143459|267.9759332|-12.216113|-41.606424|226.4634533 unknown
InChI: InChI=1S/C23H29N3O/c27-23(24-19-16-17-25(18-19)20-10-4-1-5-11-20)26(21-12-6-2-7-13-21)22-14-8-3-9-15-22/h2-3,6-9,12-15,19-20,24H,1,4-5,10-11,16-18H2
charge 0 multiplicity 1
56 atoms
O  -0.61691 -1.472691 0.997265
N  3.678595 0.548452 -0.833184
N  -0.008259 0.012737 -0.693375
N  -2.25406 -0.018931 0.082892
C  4.601069 -0.407702 -0.124127
C  2.354458 0.812666 -0.220365
C  1.410892 -0.356233 -0.67764
C  6.032814 -0.227975 -0.695324
C  4.627039 -0.184749 1.407427
C  3.307591 0.094839 -2.212945
C  1.985783 -0.74285 -2.082018
C  7.05893 -1.163687 -0.015418
C  5.659664 -1.106766 2.102806
C  7.078621 -0.939998 1.513824
C  -0.926646 -0.549441 0.185571
C  -3.373769 -0.658789 0.731108
C  -2.50177 1.202724 -0.655352
C  -4.470288 0.136936 1.159219
C  -3.336037 1.181284 -1.801719
C  -3.420515 -2.06529 0.925149
C  -1.929105 2.427222 -0.224805
C  -5.594717 -0.464277 1.763226
C  -3.590235 2.374472 -2.512753
C  -4.546463 -2.652467 1.539505
C  -2.175716 3.615739 -0.948056
C  -5.64208 -1.863017 1.959765
C  -3.007693 3.594116 -2.09221
H  4.289331 -1.470819 -0.29963
H  2.405528 0.9244 0.871587
H  1.961261 1.764919 -0.636208
H  1.493187 -1.201832 0.025431
H  6.321088 0.830514 -0.539101
H  6.034579 -0.398859 -1.788949
H  3.632197 -0.379397 1.850107
H  4.876429 0.878369 1.603847
H  4.1281 -0.478053 -2.673527
H  3.127502 0.986798 -2.843629
H  1.266845 -0.494828 -2.884218
H  2.17826 -1.827774 -2.139464
H  6.796195 -2.221641 -0.225927
H  8.064715 -0.992798 -0.445565
H  5.664978 -0.896279 3.189798
H  5.340541 -2.163267 1.986021
H  7.446669 0.084648 1.727799
H  7.780642 -1.644418 2.000781
H  -0.315102 0.731217 -1.351899
H  -4.442449 1.222632 1.023339
H  -3.782602 0.232944 -2.118248
H  -2.574667 -2.683954 0.621357
H  -1.303972 2.438317 0.674538
H  -6.430349 0.166351 2.087444
H  -4.237027 2.351226 -3.39667
H  -4.565991 -3.738332 1.686516
H  -1.730561 4.558076 -0.610337
H  -6.513184 -2.328286 2.43352
H  -3.203938 4.517795 -2.647278
