program: Gaussian 09
title: 000209501
version: EM64L-G09RevD.01
frameworkgroup: C1[X(C21H27ClN6O3)]
method: RPBEPBE
basis: SDD
operation: Freq
keyword: #p
keyword: freq=noraman
keyword: PBEPBE/SDD
title: #p freq=noraman PBEPBE/SDD
converged: YES YES NO NO
title: Mulliken charges:
elementType: Cl O O O N N N N N N C C C C C C C C C C C C C C C C C C C C C H H H H H H H H H H H H H H H H H H H H H H H H H H H
charge: -0.066406 -0.457295 -0.293463 -0.270625 -0.106166 -0.068851 -0.141005 -0.147654 -0.098009 -0.223967 -0.383501 -0.365532 -0.379638 -0.365456 -0.366512 -0.098673 -0.498955 -0.408019 0.590261 0.132730 0.069542 -0.189121 0.189273 -0.304290 -0.401983 0.209236 -0.611129 -0.232054 -0.243000 -0.602531 -0.227595 0.195478 0.238893 0.201600 0.194779 0.208776 0.220834 0.208225 0.182640 0.184362 0.223964 0.238277 0.199358 0.224403 0.225792 0.295867 0.346409 0.277727 0.243568 0.269217 0.248188 0.248381 0.253277 0.231209 0.263501 0.250385 0.251338 0.233940
chargesum: 0.00000
title: Mulliken charges with hydrogens summed into heavy atoms:
elementType: Cl O O O N N N N N N C C C C C C C C C C C C C C C C C C C C C
charge: -0.066406 -0.110887 -0.293463 -0.270625 -0.106166 -0.068851 -0.141005 -0.147654 -0.098009 -0.223967 0.050870 0.030848 0.049972 0.025409 0.041815 0.139604 -0.075194 0.113641 0.590261 0.132730 0.069542 0.088606 0.189273 -0.304290 -0.158416 0.209236 0.154657 0.021223 -0.011791 0.162693 0.006344
polarizability: 3.42817359e+02 -1.43286532e+00 3.34865674e+02 1.51264684e+01 1.36212393e+01 1.84987908e+02
1716.lowfreq: -2.5973 -0.0011 -0.0008 -0.0005 3.2456 5.8490 9.1312 14.8705 22.4407
frequency: 8.3988 14.8477 21.5902 31.2707 40.0096 42.7761 50.4502 76.0052 87.0359 94.4340 102.7244 108.6654 112.4969 117.0505 146.9159 150.7766 158.4022 180.7039 198.9513 213.1318 234.2063 255.4945 261.7310 271.9933 277.4508 290.6910 298.1780 301.4416 325.3246 335.3873 347.4257 371.6013 374.4109 381.3515 393.3500 404.1371 427.1933 428.7496 432.9183 438.4484 454.3811 478.2080 487.3599 506.4251 535.6334 545.3785 601.7542 612.7234 622.4042 647.9946 663.4945 668.7576 704.1687 718.4273 742.3701 749.3395 754.8457 769.9720 783.2875 797.0100 819.1731 823.7794 840.4917 852.7004 872.9105 893.6243 914.6059 925.4723 948.3047 958.4432 980.1074 985.5386 1003.6694 1009.6409 1019.3799 1024.0571 1030.7625 1040.0420 1049.3165 1050.9661 1057.7848 1079.4030 1095.5260 1124.3843 1130.3393 1130.8984 1132.3113 1139.9304 1146.8309 1151.6794 1163.4522 1166.9437 1172.9791 1200.2443 1202.0747 1211.3551 1213.2359 1222.6883 1229.8226 1244.9961 1257.6613 1269.5821 1272.7989 1282.4593 1295.1371 1301.2917 1304.8242 1308.4218 1325.6980 1334.5195 1338.9835 1346.6204 1361.5187 1370.1542 1374.4785 1379.7191 1380.7058 1392.0265 1398.3123 1410.4900 1424.7150 1425.5234 1427.5660 1451.7283 1455.2208 1456.2791 1460.0704 1461.4202 1469.9086 1473.5089 1473.5721 1475.4822 1477.2432 1478.1305 1479.0642 1503.6532 1568.3979 1577.1304 1605.3668 1610.7027 1643.3173 2820.9295 2849.9562 2860.6407 2869.3729 2878.7202 2886.2349 2985.6333 3008.9577 3012.4317 3023.4443 3027.1883 3029.3724 3031.3757 3032.9223 3042.8693 3067.6622 3098.4851 3103.6275 3110.3340 3123.4328 3138.7469 3139.9399 3140.4410 3157.9947 3173.2755 3255.4177 3571.1537
redmass: 5.7294 6.1105 7.2131 7.2699 6.2165 5.6316 5.6120 3.0507 1.7422 1.5491 4.6329 1.5165 3.2019 3.0247 3.9465 4.7923 6.9127 4.2042 3.8549 3.3953 3.6559 1.3098 2.1796 3.8227 3.0854 4.7241 3.1489 2.9570 4.6269 2.6790 3.4456 4.4109 5.7573 4.6697 3.0448 3.3340 2.8927 3.4692 4.4068 3.5883 4.4476 3.7562 3.4076 4.9777 4.5514 5.7944 4.8766 4.2079 2.0763 5.6921 6.3114 8.4666 10.8602 4.1582 8.1435 4.9463 1.5034 2.7352 4.9026 3.0172 1.5300 3.6437 3.0196 1.5453 1.4350 2.1184 2.9179 2.0325 1.3915 5.9337 1.9048 1.3456 2.5231 2.9346 4.8003 3.1759 2.5307 2.1155 2.1792 2.8519 1.8173 2.3602 2.1628 1.8217 1.3116 2.3211 1.3026 2.6324 2.2203 2.2724 1.6887 1.9947 1.1106 1.3485 1.7285 1.5348 1.7329 2.9145 2.0993 1.7247 1.7111 3.3241 1.3841 1.4296 1.4615 6.5904 1.3174 1.2551 1.3200 1.3370 1.5142 2.3844 1.4012 1.8620 2.6010 4.0587 1.5412 1.4705 1.4881 1.6364 1.4791 2.1160 1.4143 1.4236 1.1666 1.1006 1.6417 1.1979 1.1719 1.1377 1.0485 1.1982 1.1283 1.0435 1.1045 2.5459 8.0693 6.1125 7.2452 10.7991 9.8861 1.0709 1.0705 1.0715 1.0700 1.0697 1.0681 1.0842 1.0335 1.0329 1.0866 1.0893 1.0868 1.0824 1.0702 1.0895 1.0893 1.1025 1.1021 1.1029 1.0877 1.1023 1.0890 1.1014 1.0947 1.0996 1.0994 1.0663
irintensity: 0.3224 0.5948 0.5774 0.2468 0.0263 0.7399 0.8161 1.1502 0.1822 0.1419 0.9519 2.1644 1.2554 3.0584 4.6985 0.2968 1.6558 0.2923 4.5943 0.7004 15.6744 112.8369 10.3410 3.6486 3.6832 1.2433 3.8739 3.4280 11.7216 6.8352 25.8115 12.4430 6.5415 5.5273 5.4468 1.8205 22.0324 6.7775 12.8711 6.3620 20.5820 4.9647 0.5489 3.1732 0.4585 3.0125 5.4852 15.8655 0.2141 6.9288 18.1723 0.1543 9.1507 2.0494 13.7346 11.6554 68.0309 21.9645 1.7994 25.7706 19.4767 2.6939 10.3542 0.2753 2.8700 18.2232 5.4585 3.3609 4.3376 35.2641 0.7086 0.1291 86.9302 50.0705 35.8285 17.1686 37.4684 4.6393 49.3971 31.2121 1.6596 6.5983 15.3836 7.0085 0.6994 30.9912 0.0927 12.9318 36.0534 24.3286 9.6291 65.6357 0.5448 7.5215 16.0253 8.6303 7.9129 30.6400 22.2392 5.6001 54.6795 14.7394 13.1754 11.6883 21.9628 19.3761 13.6947 0.8110 4.0470 33.0069 6.6642 47.4734 4.0221 18.1312 30.4349 2.0405 8.0687 2.1353 5.8841 39.6685 53.2843 28.6813 92.7771 118.2985 11.8347 17.0492 13.9105 15.3058 2.1798 23.8938 23.8022 26.2156 5.1206 15.6552 4.1759 121.6557 6.4995 10.3492 3.0916 739.7522 392.4655 102.6309 51.5904 99.2719 9.0715 5.7789 303.1824 13.4281 38.7636 25.2574 3.4039 26.9003 7.7400 34.6444 84.5826 23.2980 13.3127 16.6320 16.2641 7.6100 6.2943 0.9280 9.5413 0.5458 16.5411 14.9552 2.6182 8.0341
temp: 298.150 k
press: 1.00000 atm
elementType: 17 8 8 8 7 7 7 7 7 7 6 6 6 6 6 6 6 6 6 6 6 6 6 6 6 6 6 6 6 6 6 1 1 1 1 1 1 1 1 1 1 1 1 1 1 1 1 1 1 1 1 1 1 1 1 1 1 1
symmnumber: 1
zpe: 1222917.8 jmol-1
zpe.correction: 0.465785 hartree
zpe.thermalcorrener: 0.495608 hartree
zpe.thermalcorrenthalpy: 0.496553 hartree
zpe.thermalcorrgfe: 0.401209 hartree
zpe.sumelectzpe: -1828.372403 hartree
zpe.sumelectthermal: -1828.342579 hartree
zpe.sumelectthermalent: -1828.341635 hartree
zpe.sumelectthermalfe: -1828.436979 hartree
dipole: 1.4812 -1.6216 0.6912
dipole: 2.3025
quadrupole: -211.8627 -183.9093 -180.9096
quadrupole: 16.9769 1.9406 0.0465
quadrupole: -19.6355 8.3179 11.3176 16.9769 1.9406 0.0465
hfenergy: -1828.8381879 hartree
pointgroup: C01 [X(C21H27Cl1N6O3)]
dipole: 0.573528 -0.6270699 0.3137369 debye
polarizability: 342.5721885|-0.6367112|335.9670787|16.4017209|4.4266613|184.1316738 unknown
InChI: InChI=1S/C21H27ClN6O3/c1-24-19-18(20(30)25(2)21(24)31)28(14-23-19)13-16(29)12-27-9-7-26(8-10-27)11-15-5-3-4-6-17(15)22/h3-6,14,16,29H,7-13H2,1-2H3
charge 0 multiplicity 1
58 atoms
Cl 6.736309 -1.218983 0.220452
O  -2.2863 -3.568206 1.659222
O  -1.283134 0.822304 -0.293153
O  -5.149136 3.516381 -0.111878
N  0.957937 -2.329673 0.128154
N  3.379232 -0.928556 -0.61438
N  -3.266039 -1.609516 -0.306174
N  -5.465132 1.190264 -0.127559
N  -5.528233 -1.283846 -0.163704
N  -3.248644 2.14654 -0.216176
C  1.337166 -1.054046 0.79461
C  2.170627 -3.066359 -0.311255
C  2.182779 -0.188249 -0.149585
C  3.00048 -2.199385 -1.271716
C  0.043501 -3.165569 0.930347
C  -1.386469 -2.580717 1.03044
C  4.2907 -0.100532 -1.441174
C  -1.968718 -2.307775 -0.361796
C  5.071288 0.89941 -0.602189
C  -3.475343 -0.219307 -0.256798
C  -4.871093 -0.06179 -0.178691
C  -4.517431 -2.193057 -0.235213
C  -2.555523 0.886884 -0.263279
C  6.172403 0.522993 0.203607
C  4.713629 2.272754 -0.592748
C  -4.659911 2.351204 -0.150851
C  -6.933925 1.317348 -0.053059
C  6.887511 1.440967 0.996142
C  5.410172 3.218088 0.192746
C  -2.435072 3.383995 -0.227024
C  6.498096 2.80044 0.991524
H  1.914674 -1.252354 1.732069
H  0.425103 -0.486812 1.044127
H  1.856199 -3.991795 -0.829584
H  2.814798 -3.353313 0.557015
H  1.538525 0.136314 -1.004868
H  2.510647 0.717668 0.39115
H  3.923135 -2.743207 -1.547915
H  2.402033 -2.02639 -2.202729
H  0.424383 -3.340068 1.972674
H  -0.038685 -4.159008 0.448377
H  -1.386837 -1.639138 1.616346
H  3.738468 0.452177 -2.242679
H  4.997692 -0.787883 -1.941621
H  -2.116261 -3.271286 -0.881191
H  -1.244086 -1.699163 -0.924451
H  -2.039325 -3.682187 2.611185
H  -4.652314 -3.270912 -0.223843
H  3.871884 2.594597 -1.218067
H  -7.174189 2.389909 -0.024517
H  -7.310259 0.815537 0.853856
H  -7.398419 0.844165 -0.934187
H  7.734358 1.10162 1.599815
H  5.107557 4.270457 0.180395
H  -1.379055 3.08096 -0.273642
H  -2.630133 3.973046 0.68395
H  -2.700631 4.00258 -1.0998
H  7.048212 3.521677 1.605291
