program: Gaussian 09
title: 000209445
version: EM64L-G09RevD.01
frameworkgroup: C1[X(C7H17NO6S4)]
method: RPBEPBE
basis: SDD
operation: Freq
keyword: #p
keyword: freq=noraman
keyword: PBEPBE/SDD
title: #p freq=noraman PBEPBE/SDD
converged: YES YES NO NO
title: Mulliken charges:
elementType: S S S S O O O O O O N C C C C C C C H H H H H H H H H H H H H H H H H
charge: 1.038083 1.039097 0.027407 -0.036845 -0.569839 -0.572485 -0.509828 -0.517216 -0.505611 -0.517966 -0.105797 -0.326516 -0.343353 -0.355311 -0.482174 -0.591000 -0.582057 -0.666574 0.255879 0.238250 0.252781 0.260312 0.262470 0.255528 0.289887 0.294190 0.313968 0.295152 0.297208 0.300432 0.279101 0.098407 0.117204 0.383133 0.384084
chargesum: 0.00000
title: Mulliken charges with hydrogens summed into heavy atoms:
elementType: S S S S O O O O O O N C C C C C C C
charge: 1.038083 1.039097 0.125814 0.080359 -0.186706 -0.188400 -0.509828 -0.517216 -0.505611 -0.517966 -0.105797 0.167613 0.169740 0.162687 -0.192287 0.017157 0.010302 -0.087042
polarizability: 2.34681170e+02 -2.93164363e+00 2.09372051e+02 -9.76349545e-01 -1.05533778e+01 1.57188955e+02
1716.lowfreq: -14.6328 -6.1394 -0.0025 -0.0012 0.0013 3.4635 6.3852 11.0317 12.8435
frequency: -4.6070 6.7651 11.8443 21.7220 26.0337 37.0860 48.9182 67.2015 79.8644 105.5070 114.0481 126.9450 145.7268 163.7037 173.8623 176.0895 185.3352 217.4960 222.5683 231.0755 242.0812 246.5448 265.8428 296.1088 297.2268 308.2776 313.2150 317.9745 332.7711 362.4854 368.0820 400.8828 440.1470 464.7140 496.1591 543.6416 551.1844 590.2895 596.5483 610.1313 676.7911 746.3063 779.8516 785.3258 810.9855 840.4181 841.5377 854.7685 882.6325 933.2154 935.5763 967.4335 1006.8236 1016.9421 1025.2037 1029.6567 1031.8214 1060.8926 1065.2236 1093.9652 1110.7880 1121.5110 1172.1873 1212.5492 1224.5885 1228.7299 1244.2974 1250.9866 1269.7546 1293.4414 1308.1871 1314.8594 1328.2463 1370.6674 1376.2386 1383.1460 1412.4821 1413.1749 1418.8904 1465.6514 1481.9160 1484.4114 2411.0859 2434.2461 2943.3019 2948.1575 2954.1894 3009.8117 3035.3438 3044.3875 3054.2951 3057.2390 3060.0617 3065.9538 3115.9683 3157.4188 3163.0898 3496.8536 3497.8403
redmass: 8.8302 9.8036 9.6261 11.1332 8.2526 8.5520 4.1210 4.7202 7.6373 6.0590 5.8461 2.4163 1.6187 2.9172 2.3465 1.9756 2.8292 4.2340 2.6435 2.8780 2.1110 2.8452 3.3536 4.8344 4.5287 1.1410 5.8383 5.3801 4.6132 4.4860 4.6044 5.3072 3.6102 3.5011 3.4244 12.4831 12.5128 5.8478 5.1455 3.3991 3.2727 1.2467 1.1676 1.2081 2.0740 4.9243 9.4115 2.2113 2.7268 3.8687 3.9266 1.7126 1.9877 1.7598 1.7053 1.8473 2.0142 2.0912 2.1860 1.7550 2.1062 1.7087 1.2375 1.1854 1.4399 1.3898 1.2440 1.3506 1.3765 1.1611 1.2813 1.2515 1.2511 1.3016 1.2911 1.2535 1.0877 1.1124 1.1059 1.0854 1.0806 1.0765 1.0378 1.0381 1.0664 1.0677 1.0675 1.0816 1.0625 1.0940 1.0864 1.0812 1.0771 1.0586 1.1048 1.1113 1.1116 1.0665 1.0665
irintensity: 0.2900 0.0771 0.0607 1.9397 1.2257 0.9285 1.0975 0.7509 1.8042 8.1364 5.1851 17.9795 47.1687 5.4277 18.7560 51.5675 10.6838 12.1142 14.3163 16.6363 28.6131 45.2001 5.0331 21.5286 93.0962 1.8934 18.1201 6.1626 7.2360 52.1232 46.0572 22.5639 20.9002 20.7213 1.5905 189.5785 143.7907 18.9696 10.1790 9.4032 17.1326 3.1575 3.0801 1.9107 1.4749 53.1998 38.7058 21.6782 6.4300 33.9963 152.8089 23.2267 11.4595 41.4229 41.6780 39.2445 3.3840 6.0672 62.7985 44.7151 91.1425 52.7147 8.7469 0.1169 7.6656 21.8255 7.2702 9.3571 4.8500 2.3064 7.7417 5.9065 14.7023 4.0478 0.8572 8.3685 12.7124 14.0931 5.3059 8.8700 15.7596 12.0451 13.4979 17.4713 20.4717 25.8045 40.3475 2.7600 16.3531 7.3616 5.2512 11.3032 5.9362 2.5988 5.1384 2.9628 0.1117 54.9194 54.5781
temp: 298.150 k
press: 1.00000 atm
elementType: 16 16 16 16 8 8 8 8 8 8 7 6 6 6 6 6 6 6 1 1 1 1 1 1 1 1 1 1 1 1 1 1 1 1 1
symmnumber: 1
zpe: 651530.7 jmol-1
zpe.correction: 0.248155 hartree
zpe.thermalcorrener: 0.272505 hartree
zpe.thermalcorrenthalpy: 0.273450 hartree
zpe.thermalcorrgfe: 0.188553 hartree
zpe.sumelectzpe: -2373.420178 hartree
zpe.sumelectthermal: -2373.395828 hartree
zpe.sumelectthermalent: -2373.394884 hartree
zpe.sumelectthermalfe: -2373.479780 hartree
dipole: -0.5774 2.8947 2.2636
dipole: 3.7197
quadrupole: -160.0529 -153.1614 -143.4494
quadrupole: -5.9319 4.3334 -8.1786
quadrupole: -7.8317 -0.9402 8.7718 -5.9319 4.3334 -8.1786
hfenergy: -2373.6683332 hartree
pointgroup: C01 [X(C7H17N1O6S4)]
dipole: -0.018253 -1.2190932 0.8094405 debye
polarizability: 232.4455245|-8.0021411|209.5060387|6.2546116|13.3904395|159.2906133 unknown
InChI: InChI=1S/C7H17NO6S4/c9-17(10,11)3-1-8(5-7(16)6-15)2-4-18(12,13)14/h7,9,12,15-16H,1-6H2
charge 0 multiplicity 1
35 atoms
S  3.539519 1.381177 0.264367
S  -3.6817 1.596937 0.200109
S  -0.623835 -4.539466 -1.089297
S  1.602466 -3.34721 1.475981
O  4.008693 1.263729 2.06584
O  -3.993087 1.760457 2.033769
O  4.669632 0.668872 -0.650064
O  3.065475 2.888297 -0.093105
O  -3.661201 3.060539 -0.489952
O  -4.616562 0.432545 -0.427593
N  -0.118875 -0.407695 -0.59025
C  0.036193 -1.794759 -1.094357
C  1.062918 0.466687 -0.735499
C  -1.426429 0.229221 -0.839435
C  -0.695576 -2.84356 -0.223956
C  1.988415 0.258514 0.475816
C  -1.902271 0.897154 0.461494
C  -0.225889 -2.905059 1.238422
H  -0.328294 -1.891449 -2.140545
H  1.114636 -2.041257 -1.094633
H  1.613478 0.264194 -1.679903
H  0.742083 1.523341 -0.768848
H  -2.158658 -0.542579 -1.136674
H  -1.384201 0.973458 -1.663395
H  -1.783588 -2.635402 -0.219591
H  1.54791 0.600781 1.423913
H  2.410763 -0.754545 0.566617
H  -2.031491 0.184054 1.288714
H  -1.324147 1.78149 0.770725
H  -0.826905 -3.626612 1.812182
H  -0.317698 -1.907075 1.700966
H  0.762646 -4.585422 -1.155035
H  1.467738 -4.701104 1.215142
H  4.898736 1.70374 2.186793
H  -4.862394 2.237508 2.16428
