program: Gaussian 09
title: 000209412
version: EM64L-G09RevD.01
frameworkgroup: C1[X(C11H20O3S)]
method: RPBEPBE
basis: SDD
operation: Freq
keyword: #p
keyword: freq=noraman
keyword: PBEPBE/SDD
title: #p freq=noraman PBEPBE/SDD
converged: YES YES NO NO
title: Mulliken charges:
elementType: S O O O C C C C C C C C C C C H H H H H H H H H H H H H H H H H H H H
charge: 0.952534 -0.421708 -0.400807 -0.559538 -0.000953 -0.423126 -0.408166 -0.361504 -0.368752 -0.354056 -0.724988 -0.696118 -0.418210 0.240478 -0.450706 0.217461 0.187593 0.199840 0.220185 0.207928 0.204181 0.191507 0.237517 0.225762 0.195729 0.194507 0.215716 0.216868 0.238442 0.217016 0.210874 0.210551 0.252962 0.273835 0.277146
chargesum: 0.00000
title: Mulliken charges with hydrogens summed into heavy atoms:
elementType: S O O O C C C C C C C C C C C
charge: 0.952534 -0.421708 -0.400807 -0.559538 0.216508 -0.035692 0.019947 0.034184 0.094527 0.036181 -0.053962 -0.057677 0.108586 0.240478 -0.173561
polarizability: 2.33945583e+02 1.07985946e+01 1.30285486e+02 -1.14139416e+01 2.00160229e+00 1.17508804e+02
1716.lowfreq: -28.2732 -1.9548 -0.0022 -0.0009 -0.0009 4.5604 5.5174 18.1080 28.7053
frequency: -18.9034 17.8730 28.6157 35.5005 45.0791 55.3145 69.8464 86.7826 106.4712 132.3937 156.9323 171.2728 199.1981 221.9750 225.0655 247.3801 258.1435 270.5726 277.7880 310.1671 310.8742 383.5232 407.2112 423.7512 448.9616 490.4324 531.7468 555.7463 574.3121 631.3195 675.4236 728.9390 757.6938 772.2911 802.0092 861.9002 876.6424 893.1442 906.2786 914.7498 948.0898 962.6473 970.9726 975.6054 991.5795 1026.5806 1037.2573 1076.3495 1090.8941 1128.1426 1149.3956 1156.1692 1208.1296 1214.7975 1227.9470 1249.8583 1266.5117 1279.8142 1289.9510 1295.7247 1327.6954 1330.5449 1342.6575 1349.1072 1356.8556 1361.5364 1388.9491 1394.9950 1436.6221 1456.2178 1466.6265 1469.5875 1475.2629 1476.5231 1480.6963 1486.2006 1492.0575 1493.2090 2144.1518 2929.9985 2956.4360 2959.8945 2965.1532 2969.4259 2972.4461 2973.2921 2979.0467 2993.5056 2999.6473 3010.2934 3034.9270 3035.7016 3038.0268 3044.1653 3068.8571 3071.9458 3072.0074 3074.9235 3425.4886
redmass: 3.8522 5.4111 5.8728 5.0750 3.9242 2.8729 1.6386 3.9324 2.8501 2.8791 3.6619 1.7671 5.3034 1.2073 3.5537 1.4456 3.8496 4.2605 3.3567 2.2979 2.7750 5.4759 8.7212 3.5122 4.0476 3.8430 2.3730 8.7943 6.2860 1.2343 1.2539 1.0988 1.5344 1.5407 1.3092 9.8349 3.8937 2.6403 4.1949 1.5520 3.2152 1.9438 2.1937 2.2777 1.5967 1.4025 2.6472 2.4332 2.0559 1.7977 2.2773 2.3162 1.3462 1.2383 1.0603 1.2452 1.2142 1.1374 1.0674 1.2620 1.2093 1.4219 1.4847 1.3569 1.5133 1.3252 1.2168 1.2173 1.0830 1.0722 1.0694 1.0689 1.0432 1.0585 1.0715 1.0719 1.0667 1.0599 6.0057 1.0655 1.0588 1.0593 1.0649 1.0618 1.0367 1.0699 1.0372 1.0755 1.0850 1.1007 1.0932 1.1026 1.1013 1.1053 1.1007 1.0987 1.0991 1.1005 1.1599
irintensity: 0.1205 0.2404 0.2793 0.5912 0.3855 0.2985 0.0136 0.5784 0.8817 1.2259 0.5705 1.6146 1.1695 1.1958 10.9464 0.1629 4.1487 8.7629 5.1921 0.4027 21.7035 4.9371 93.4510 14.2461 6.1683 18.8697 6.8092 47.8680 74.4860 72.2367 57.8600 8.8482 6.0122 15.3083 4.1484 63.6499 66.4327 22.3948 32.1496 15.1324 55.6586 0.6632 10.6206 20.4706 7.0084 2.6469 0.3190 2.1868 13.6540 1.2769 1.4711 5.9177 2.1506 4.8979 6.5017 3.5433 0.6746 2.9761 0.7866 2.3218 28.4929 5.0476 6.2188 0.7336 0.1724 0.7150 11.5958 19.4118 16.0191 7.1859 1.6474 3.1798 12.4939 3.3063 25.8680 21.6453 8.5828 4.8346 1.8223 7.3235 4.7383 0.1722 14.3047 63.9565 42.2077 28.3718 31.4923 18.4849 36.6340 6.2001 4.8041 36.5249 15.7973 60.9483 91.8587 82.2810 12.6772 57.2231 67.0165
temp: 298.150 k
press: 1.00000 atm
elementType: 16 8 8 8 6 6 6 6 6 6 6 6 6 6 6 1 1 1 1 1 1 1 1 1 1 1 1 1 1 1 1 1 1 1 1
symmnumber: 1
zpe: 757920.5 jmol-1
zpe.correction: 0.288677 hartree
zpe.thermalcorrener: 0.307818 hartree
zpe.thermalcorrenthalpy: 0.308762 hartree
zpe.thermalcorrgfe: 0.238380 hartree
zpe.sumelectzpe: -1053.506605 hartree
zpe.sumelectthermal: -1053.487464 hartree
zpe.sumelectthermalent: -1053.486519 hartree
zpe.sumelectthermalfe: -1053.556902 hartree
dipole: 1.5239 -1.0078 0.5235
dipole: 1.9006
quadrupole: -93.2546 -97.1539 -106.2475
quadrupole: 0.3483 -3.0230 -2.7934
quadrupole: 5.6307 1.7315 -7.3622 0.3483 -3.0230 -2.7934
hfenergy: -1053.7952816 hartree
pointgroup: C01 [X(C11H20O3S1)]
dipole: 0.6092995 -0.4031546 -0.1591554 debye
polarizability: 231.0448034|21.6060739|124.57088|-10.7253352|4.7076545|126.1241901 unknown
InChI: InChI=1S/C11H20O3S/c1-4-7-8-11(6-3)10-14-15(12)13-9-5-2/h2,11H,4,6-10H2,1,3H3
charge 0 multiplicity 1
35 atoms
S  -2.373802 1.325679 0.594173
O  -0.82968 1.646685 -0.351175
O  -3.322898 0.31549 -0.720346
O  -2.017786 0.22825 1.733458
C  1.563293 1.093404 -0.322448
C  2.569055 -0.058773 -0.610509
C  1.810202 1.831712 1.022604
C  4.048691 0.38635 -0.647161
C  0.134709 0.517235 -0.417856
C  5.006192 -0.759202 -1.049981
C  1.779756 0.941408 2.286625
C  6.48761 -0.32462 -1.066941
C  -3.615616 -1.077265 -0.303459
C  -5.035314 -1.257904 0.02828
C  -6.225224 -1.428751 0.301676
H  1.668167 1.842126 -1.135724
H  2.314568 -0.517998 -1.589081
H  2.448578 -0.859895 0.14778
H  1.048781 2.628963 1.118791
H  2.788271 2.346973 0.96377
H  4.351927 0.774002 0.345921
H  4.163635 1.22883 -1.360933
H  -0.060251 -0.189772 0.414835
H  -0.02529 0.003588 -1.384465
H  4.876376 -1.606311 -0.345457
H  4.718923 -1.14096 -2.051009
H  2.557795 0.156367 2.254594
H  1.96437 1.552996 3.188638
H  0.799779 0.447971 2.422294
H  7.15185 -1.160519 -1.353523
H  6.651061 0.499331 -1.786952
H  6.806679 0.03398 -0.070013
H  -3.323023 -1.709032 -1.162109
H  -2.979413 -1.347826 0.569276
H  -7.263571 -1.569714 0.542026
