program: Gaussian 09
title: 000209364
version: EM64L-G09RevD.01
frameworkgroup: C1[X(C10H14N6O2)]
method: RPBEPBE
basis: SDD
operation: Freq
keyword: #p
keyword: freq=noraman
keyword: PBEPBE/SDD
title: #p freq=noraman PBEPBE/SDD
converged: YES YES NO NO
title: Mulliken charges:
elementType: O O N N N N N N C C C C C C C C C C H H H H H H H H H H H H H H
charge: -0.300972 -0.274793 -0.232466 -0.158180 -0.220860 -0.113354 -0.362228 -0.506785 0.158601 0.096008 0.149402 0.167393 -0.482150 0.204212 -0.616936 -0.602170 -0.040869 -0.580379 0.235744 0.294284 0.272823 0.243218 0.243607 0.268096 0.248045 0.248118 0.345425 0.252764 0.302709 0.305042 0.229650 0.226997
chargesum: 0.00000
title: Mulliken charges with hydrogens summed into heavy atoms:
elementType: O O N N N N N N C C C C C C C C C C
charge: -0.300972 -0.274793 -0.232466 -0.158180 -0.220860 -0.113354 -0.016803 0.100966 0.158601 0.096008 0.149402 0.167393 0.047878 0.204212 0.142712 0.162090 0.211895 -0.123731
polarizability: 2.30784793e+02 -4.35429297e+00 1.74720184e+02 4.70445625e+00 2.34063687e+00 8.82580232e+01
1716.lowfreq: -6.9773 -2.8110 -0.0003 0.0003 0.0006 6.3192 41.3615 61.8487 79.4165
frequency: 41.3302 61.8405 79.4105 93.0234 97.5042 104.0220 118.8509 124.5401 138.2512 143.2238 182.2139 194.8832 208.1379 252.7017 282.4218 293.6170 310.9967 323.2081 342.9847 372.5339 386.5276 390.5459 418.9410 479.3089 492.6402 539.1397 586.5812 601.8511 644.6319 690.6281 699.1495 705.7169 729.9532 741.0410 755.9352 785.6688 851.1297 912.4786 937.8812 957.9218 966.9925 993.4933 1014.0210 1041.9761 1055.8376 1129.1717 1131.8181 1140.7992 1176.6090 1197.6610 1222.2552 1227.3813 1252.5531 1269.1017 1282.6371 1289.7802 1301.9340 1309.9342 1376.2691 1394.8054 1411.9390 1427.0690 1431.8292 1456.8538 1466.1393 1474.1498 1477.7261 1478.9744 1481.2422 1502.7664 1536.8268 1587.5892 1621.3233 1649.1742 1652.0671 1683.9438 2979.5396 3005.4207 3010.0933 3041.5010 3088.9774 3093.9525 3101.2353 3111.3984 3136.6185 3137.4591 3202.2477 3391.4676 3510.5653 3530.4066
redmass: 4.5434 4.1064 4.1280 1.9534 1.2345 3.1290 1.2628 3.2086 4.1378 3.5659 3.3226 1.4030 2.8237 4.7000 3.1452 3.9295 4.0437 5.6712 3.7009 3.6054 4.9385 7.7869 5.4473 3.9896 5.7705 1.6583 2.1220 2.5397 7.2714 3.8970 10.4548 7.9653 11.0108 3.9023 3.4245 2.0618 4.3399 1.5734 2.7299 4.7161 1.3499 2.1035 1.2376 2.9895 3.9125 1.3020 1.2985 2.1404 3.9194 3.4223 3.7648 3.0501 2.6189 2.5176 1.3163 1.1801 3.2957 2.2328 1.9018 2.0577 1.3205 1.2213 1.3491 2.1195 1.1192 1.0439 1.0879 1.0735 1.2722 2.3591 5.8810 8.0545 10.7867 9.2567 4.6524 1.0627 1.0593 1.0336 1.0327 1.1046 1.0608 1.1024 1.1021 1.0946 1.1022 1.1011 1.1139 1.0431 1.0989 1.0792
irintensity: 0.3412 0.0478 1.3312 0.0934 0.1074 0.6703 1.6245 10.7940 0.4121 0.6481 6.3007 10.0485 11.5112 6.3648 3.5406 11.9992 3.1997 2.2863 8.2813 4.0329 5.2799 21.3065 27.2906 20.8264 29.9804 128.1545 63.9719 2.1929 4.0747 5.4439 3.1939 1.4603 21.1782 29.2754 40.0209 106.0394 10.6672 18.4028 28.5079 42.2700 64.7843 17.3365 35.6583 62.5543 24.0442 0.2802 0.1676 2.0554 11.3105 107.9707 21.3331 2.3525 19.9992 32.3947 5.1299 0.2977 22.2880 64.5314 16.8979 26.9777 7.3927 28.7332 22.0998 297.5086 16.1837 18.4590 25.1003 38.3462 117.7777 71.8960 355.5206 296.6693 374.5557 451.6385 43.3481 27.4195 48.4878 38.1579 32.8449 17.4741 7.1471 19.6379 18.8066 6.2669 0.7286 0.4320 17.4634 1.2040 2.8508 89.6702
temp: 298.150 k
press: 1.00000 atm
elementType: 8 8 7 7 7 7 7 7 6 6 6 6 6 6 6 6 6 6 1 1 1 1 1 1 1 1 1 1 1 1 1 1
symmnumber: 1
zpe: 655128.3 jmol-1
zpe.correction: 0.249525 hartree
zpe.thermalcorrener: 0.267734 hartree
zpe.thermalcorrenthalpy: 0.268678 hartree
zpe.thermalcorrgfe: 0.203408 hartree
zpe.sumelectzpe: -867.071747 hartree
zpe.sumelectthermal: -867.053538 hartree
zpe.sumelectthermalent: -867.052594 hartree
zpe.sumelectthermalfe: -867.117864 hartree
dipole: -4.5839 1.3574 -0.0338
dipole: 4.7808
quadrupole: -109.4177 -106.8940 -102.0730
quadrupole: 3.0108 -0.2135 -1.3010
quadrupole: -3.2895 -0.7658 4.0553 3.0108 -0.2135 -1.3010
hfenergy: -867.3212717 hartree
pointgroup: C01 [X(C10H14N6O2)]
dipole: -1.8211468 -0.4700014 -0.0189363 debye
polarizability: 231.1083207|2.4175524|174.3091885|-2.9294251|4.6290216|88.3454908 unknown
InChI: InChI=1S/C10H14N6O2/c1-4-5-16-6-7(12-9(16)13-11)14(2)10(18)15(3)8(6)17/h4,13H,1,5,11H2,2-3H3
charge 0 multiplicity 1
32 atoms
O  0.865368 2.709151 0.308894
O  4.036769 -0.758738 -0.160403
N  -1.287184 0.443221 0.211959
N  1.770225 -1.370757 -0.108061
N  2.440379 0.942398 0.074162
N  -0.669485 -1.76202 -0.031443
N  -3.036227 -1.257924 0.154811
N  -3.417471 -2.619712 0.031092
C  0.127629 0.407352 0.139506
C  0.45485 -0.94841 -0.003434
C  -1.707408 -0.879851 0.104682
C  1.095838 1.459326 0.185482
C  -2.122514 1.640574 0.456571
C  2.821126 -0.418591 -0.069987
C  2.089667 -2.803063 -0.256237
C  3.556212 1.914605 0.111691
C  -3.143839 1.867769 -0.642453
C  -4.473437 2.030773 -0.424278
H  -2.624714 1.547342 1.438951
H  -1.416574 2.491683 0.506613
H  3.18378 -2.893215 -0.320127
H  1.619377 -3.20379 -1.169913
H  1.710652 -3.367694 0.612225
H  3.112443 2.914588 0.225022
H  4.143225 1.854139 -0.819437
H  4.22666 1.689208 0.957192
H  -3.767807 -0.572445 -0.0425
H  -2.737955 1.924961 -1.66254
H  -3.209575 -3.129446 0.900083
H  -2.947039 -3.064161 -0.771312
H  -5.16706 2.237941 -1.245853
H  -4.90051 1.991886 0.586444
