program: Gaussian 09
title: 000209363
version: EM64L-G09RevD.01
frameworkgroup: C1[X(C22H24N2O2)]
method: RPBEPBE
basis: SDD
operation: Freq
keyword: #p
keyword: freq=noraman
keyword: PBEPBE/SDD
title: #p freq=noraman PBEPBE/SDD
converged: YES YES NO NO
title: Mulliken charges:
elementType: O O N N C C C C C C C C C C C C C C C C C C C C C C H H H H H H H H H H H H H H H H H H H H H H H H
charge: -0.296731 -0.290534 -0.104533 -0.052256 -0.292047 0.147270 -0.566243 0.278482 0.259421 0.386976 -0.589114 -0.626320 0.258393 -0.533579 -0.373532 -0.464460 0.213328 -0.386126 -0.244643 -0.355289 -0.525934 -0.293991 -0.263082 -0.393555 -0.607551 -0.047632 0.223078 0.283621 0.240963 0.239308 0.315733 0.220705 0.209071 0.231419 0.225028 0.247069 0.237272 0.289195 0.225597 0.229912 0.262982 0.243788 0.229843 0.224758 0.270039 0.238689 0.242105 0.222645 0.241372 0.169088
chargesum: 0.00000
title: Mulliken charges with hydrogens summed into heavy atoms:
elementType: O O N N C C C C C C C C C C C C C C C C C C C C C C
charge: -0.296731 -0.290534 -0.104533 -0.052256 -0.068969 0.147270 -0.041659 0.278482 0.259421 0.386976 -0.034073 -0.196544 0.258393 -0.077132 -0.126463 -0.227188 0.213328 -0.096932 -0.019046 -0.125377 -0.019164 -0.064147 -0.038324 0.115173 0.098571 0.121456
polarizability: 2.74841150e+02 1.61847009e+01 2.75625565e+02 -1.77209528e+01 -4.32066362e+00 1.82857674e+02
1716.lowfreq: -8.7056 -5.5760 -0.0004 -0.0003 -0.0001 3.8749 22.6780 27.2777 39.7958
frequency: 22.6542 27.1932 39.7764 43.8071 77.5591 85.1269 107.3042 116.0219 140.6597 148.5793 161.5462 167.6097 196.4719 224.6155 237.6533 249.0119 263.4591 282.9589 307.6419 319.8923 327.3401 349.1723 382.4534 389.5010 395.0058 434.1016 436.2926 448.6132 470.9324 479.3759 497.7546 522.4988 538.0228 568.8186 591.6214 607.2780 617.0283 627.1090 648.3695 674.2528 700.4347 709.2417 725.0366 758.2469 761.9559 777.2014 789.8159 805.8340 811.7070 850.9959 876.0610 886.6862 888.2487 903.5368 950.9123 955.8363 959.0343 969.6853 970.8777 982.1020 989.6211 995.3303 1004.4711 1015.3060 1030.7896 1043.0893 1060.9390 1067.6761 1072.7064 1091.4396 1098.7440 1117.0598 1142.3089 1160.8731 1168.3805 1173.3483 1180.9587 1195.3976 1202.0296 1207.6405 1220.9195 1230.9652 1234.3637 1252.4743 1258.2154 1263.7277 1277.3518 1279.6280 1289.7792 1297.7256 1307.7775 1332.4663 1345.9603 1356.4575 1359.3993 1369.8759 1370.7600 1377.4140 1388.3288 1395.8704 1424.9634 1430.7857 1440.8292 1447.0108 1455.7285 1459.6846 1463.8246 1466.7926 1479.8675 1482.0661 1484.6021 1492.8834 1493.9088 1500.2842 1574.5497 1582.7984 1605.2100 1607.1085 1610.2661 1610.7863 2911.6065 2945.2441 2955.1851 2959.1265 2972.5846 2976.2402 2977.1640 3008.3816 3019.5529 3030.4787 3038.7802 3039.5369 3052.2701 3077.7573 3087.7836 3097.6568 3102.7599 3103.6556 3117.5465 3126.2766 3126.3276 3141.6287 3153.9962 3156.8325
redmass: 5.3770 4.6428 4.1460 5.7895 4.5104 4.1749 5.3636 3.9567 2.9130 1.5702 2.1941 4.5131 4.2255 3.5172 3.6701 2.6669 3.1115 4.9960 3.1099 3.1872 4.2967 4.9891 3.2679 2.6976 2.4415 3.6978 3.5927 2.7567 3.1576 3.6671 3.5813 4.0055 4.1629 4.1185 4.9978 3.4409 3.8927 4.7251 5.2446 4.5337 4.1128 3.3265 3.2771 2.3306 1.5420 2.8292 1.4767 2.2196 2.1207 2.9437 3.7933 2.1634 1.8103 1.4107 1.8432 2.3305 1.5977 1.9070 1.8740 1.5487 2.2513 1.3829 2.3720 3.5722 2.4887 2.9645 1.7345 2.0460 2.1992 1.9229 2.4141 1.3086 1.6294 1.4426 1.5109 1.2891 1.2461 2.7823 1.7484 1.8134 1.9570 1.4451 1.5043 1.4058 1.8618 1.6227 1.3573 1.5250 1.5732 1.6487 1.5337 1.5121 1.7568 2.0187 1.2738 1.5953 1.2949 2.3733 2.4794 3.2513 2.4307 2.1664 1.2076 1.2118 1.1637 2.1377 1.0504 2.2180 1.1700 1.4564 1.1192 1.1148 1.1052 1.5132 6.7381 6.4045 6.7319 6.3738 5.5625 5.9324 1.0694 1.0863 1.0782 1.0600 1.0344 1.0733 1.0659 1.0965 1.0598 1.0621 1.0881 1.0991 1.1022 1.1036 1.0995 1.0916 1.1055 1.0875 1.0862 1.0903 1.0891 1.0934 1.0991 1.1008
irintensity: 0.9649 1.3374 0.4394 5.0160 5.9530 7.2496 5.1378 1.0128 0.7075 0.2130 0.0040 3.1539 0.7595 1.1665 5.2460 2.5156 3.5158 0.4197 1.7187 12.5046 9.7743 5.3647 7.9439 0.4262 6.3254 12.6501 3.4953 7.1695 9.5759 2.0794 1.5467 0.5306 1.3016 3.0128 8.2491 8.8501 6.7990 2.6905 5.4421 5.9439 4.3078 1.3769 4.9697 11.5123 39.2960 7.6270 61.9044 4.5577 4.0036 3.4765 3.4106 4.1553 3.3850 0.3713 1.1557 2.4247 0.7820 3.1999 4.3281 1.5041 4.0893 2.1904 21.9099 16.7768 16.2743 5.0899 33.0963 19.5596 4.8517 6.4098 4.8563 0.1776 3.5124 0.9757 2.8530 1.0584 4.8084 2.8418 1.7624 9.3869 67.8207 1.5674 4.3435 4.0435 16.6879 14.7695 4.7609 9.9818 12.4088 80.6781 1.8153 4.1361 8.0322 6.4260 25.6168 1.6659 21.8686 5.7773 8.4337 2.6251 79.1162 11.7637 4.5731 7.3318 19.0626 21.3769 12.8491 17.9170 35.8457 36.1421 23.3777 14.0946 17.4628 37.7695 187.4741 27.7495 2.9810 56.4992 254.1590 22.7609 38.5581 124.5433 8.7372 29.0317 75.3814 53.7453 30.3110 45.0044 4.9016 31.9206 21.4171 33.9140 27.8717 1.6016 20.3725 4.7096 21.7855 10.8840 1.8602 1.4486 40.6277 3.6499 34.1068 41.1638
temp: 298.150 k
press: 1.00000 atm
elementType: 8 8 7 7 6 6 6 6 6 6 6 6 6 6 6 6 6 6 6 6 6 6 6 6 6 6 1 1 1 1 1 1 1 1 1 1 1 1 1 1 1 1 1 1 1 1 1 1 1 1
symmnumber: 1
zpe: 1087276.4 jmol-1
zpe.correction: 0.414122 hartree
zpe.thermalcorrener: 0.436646 hartree
zpe.thermalcorrenthalpy: 0.437590 hartree
zpe.thermalcorrgfe: 0.361785 hartree
zpe.sumelectzpe: -1110.837919 hartree
zpe.sumelectthermal: -1110.815395 hartree
zpe.sumelectthermalent: -1110.814450 hartree
zpe.sumelectthermalfe: -1110.890255 hartree
dipole: -1.8490 0.3357 -2.0389
dipole: 2.7728
quadrupole: -117.5305 -160.7025 -153.8854
quadrupole: 7.8581 6.9138 11.0248
quadrupole: 26.5090 -16.6630 -9.8459 7.8581 6.9138 11.0248
hfenergy: -1111.2520409 hartree
pointgroup: C01 [X(C22H24N2O2)]
dipole: 0.7486455 0.0520205 -0.791771 debye
polarizability: 276.6177893|6.5836729|259.3699968|27.3697276|30.1372156|197.3366024 unknown
InChI: InChI=1S/C22H24N2O2/c1-23(15-25)12-11-21(26)24-13-18-7-4-6-17-10-9-16-5-2-3-8-19(16)20(14-24)22(17)18/h2-8,15,20H,9-14H2,1H3
charge 0 multiplicity 1
50 atoms
O  1.887805 0.708792 2.907371
O  3.308756 -2.213878 -1.520944
N  0.760115 -0.867247 1.611435
N  4.464932 -0.284443 -0.876248
C  -1.651093 -0.234542 1.300117
C  -1.69223 -1.272819 0.171931
C  -0.525524 -0.606162 2.294378
C  -1.619158 1.217938 0.760165
C  -0.566563 -2.081938 -0.122966
C  -2.890739 -1.430094 -0.581492
C  0.734491 -2.004898 0.669398
C  -4.070727 -0.525767 -0.282289
C  -2.619691 1.713459 -0.135914
C  -3.812462 0.93757 -0.720654
C  -0.634288 -3.027224 -1.177563
C  -2.947997 -2.388613 -1.617331
C  1.909811 -0.202463 2.012322
C  -0.594086 2.107581 1.185188
C  -1.819498 -3.18483 -1.921564
C  -2.538908 3.066124 -0.566728
C  3.216124 -0.555092 1.296128
C  -0.534706 3.44664 0.746472
C  -1.5160 3.935126 -0.14208
C  3.31617 0.18521 -0.070963
C  5.707465 0.501615 -0.891941
C  4.345466 -1.48139 -1.54873
H  -2.592564 -0.335715 1.880296
H  -0.353295 0.168521 3.056936
H  -0.830746 -1.536656 2.816496
H  0.858814 -2.954413 1.238461
H  1.577386 -1.950008 -0.040933
H  -4.96565 -0.889075 -0.821141
H  -4.324995 -0.551287 0.79584
H  -3.69658 0.937865 -1.824052
H  -4.729957 1.52532 -0.513487
H  0.250537 -3.629942 -1.41564
H  -3.875672 -2.507745 -2.190008
H  0.176619 1.766747 1.882844
H  -1.864314 -3.918176 -2.734273
H  -3.310104 3.439537 -1.25377
H  3.310631 -1.640243 1.121679
H  4.035995 -0.233881 1.959586
H  0.269848 4.098746 1.104674
H  -1.489742 4.972916 -0.493105
H  2.397365 0.013335 -0.658727
H  3.418884 1.271611 0.094329
H  5.537551 1.503665 -1.328063
H  6.467036 -0.018899 -1.50056
H  6.111104 0.629459 0.129958
H  5.255983 -1.751234 -2.129344
