program: Gaussian 09
title: 000209350
version: EM64L-G09RevD.01
frameworkgroup: C1[X(C6H6N4O2)]
method: RPBEPBE
basis: SDD
operation: Freq
keyword: #pfreq=noraman
keyword: PBEPBE/SDD
title: #p freq=noraman PBEPBE/SDD
converged: NO YES NO NO
title: Mulliken charges:
elementType: O O N N N N C C C C C C H H H H H H
charge: -0.225877 -0.177129 -0.153665 -0.032954 0.072021 0.025941 0.275600 -0.258439 -0.408393 0.101870 -0.754683 -0.102554 0.307201 0.279415 0.280835 0.285189 0.253693 0.231928
chargesum: 0.00000
title: Mulliken charges with hydrogens summed into heavy atoms:
elementType: O O N N N N C C C C C C
charge: -0.225877 -0.177129 -0.153665 -0.032954 0.072021 0.025941 0.275600 0.048762 0.151857 0.101870 0.016128 -0.102554
polarizability: 1.34594261e+02 1.32074243e+00 9.57613751e+01 -1.62539546e+00 5.52306713e+00 6.17728280e+01
1716.lowfreq: -9.8833 -5.9600 0.0005 0.0007 0.0008 2.4734 21.6862 51.6571 81.4718
frequency: 21.4188 51.6241 81.4695 134.6466 161.0854 168.2270 228.0579 245.2598 317.3416 343.8867 368.9279 386.2123 488.2145 550.5010 598.6397 649.2113 682.4372 712.2137 732.3969 774.2968 804.7606 917.0941 948.7274 951.1029 997.4183 1049.1942 1105.8686 1138.5342 1194.4614 1234.1764 1294.5377 1323.8871 1347.2427 1368.0943 1393.6689 1405.1814 1445.9213 1465.1312 1472.0339 1503.3606 1528.8509 2212.6342 2983.5898 3022.6989 3059.5880 3081.0799 3127.1956 3265.3669
redmass: 6.2056 12.6969 7.5033 1.1983 4.2570 4.9249 4.1226 2.7093 6.5219 3.1665 8.9110 4.8595 6.9352 5.1237 4.9092 5.6023 5.2946 4.7389 8.2909 4.6413 1.6921 4.6683 2.0946 5.2339 1.8904 1.4771 1.8687 2.3412 3.4904 2.7171 8.7318 1.8554 1.6683 8.4653 3.6962 1.3438 1.1134 1.1597 1.0467 5.9606 5.9401 12.4230 1.0401 1.0604 1.0979 1.1018 1.0961 1.1018
irintensity: 8.2402 0.8416 4.1346 0.7904 0.3645 1.0675 3.1786 2.3758 5.7583 1.1177 0.3849 2.4415 0.2651 2.1688 0.4543 8.7669 19.3070 14.0634 5.4593 39.7859 29.9787 11.7046 3.8608 3.0550 3.9868 3.3233 11.1773 11.6873 166.3968 114.3048 27.4819 30.3625 8.8016 157.2364 18.0714 8.4425 27.1519 9.8183 27.4319 45.1978 72.4746 0.1512 15.0840 6.5200 11.5950 0.0662 1.8284 9.5441
temp: 298.150 k
press: 1.00000 atm
elementType: 8 8 7 7 7 7 6 6 6 6 6 6 1 1 1 1 1 1
symmnumber: 1
zpe: 325010.2 jmol-1
zpe.correction: 0.123790 hartree
zpe.thermalcorrener: 0.135045 hartree
zpe.thermalcorrenthalpy: 0.135989 hartree
zpe.thermalcorrgfe: 0.084801 hartree
zpe.sumelectzpe: -600.700363 hartree
zpe.sumelectthermal: -600.689108 hartree
zpe.sumelectthermalent: -600.688164 hartree
zpe.sumelectthermalfe: -600.739352 hartree
dipole: 6.3928 0.0973 -4.3503
dipole: 7.7332
quadrupole: -91.9973 -68.1763 -68.5055
quadrupole: 4.9511 -9.0126 2.8840
quadrupole: -15.7710 8.0501 7.7209 4.9511 -9.0126 2.8840
hfenergy: -600.8241531 hartree
pointgroup: C01 [X(C6H6N4O2)]
dipole: -2.4795115 -0.3744491 -1.7228994 debye
dipolederiv: -0.6212873 -0.156772 -0.0201418 -0.2462141 -0.7522642 0.1236874 -0.0062781 0.1305402 -0.2937762 -0.7445365 0.1707315 -0.1599374 0.1034723 -0.4997007 0.1196558 -0.1568332 0.1351002 -0.2818808 -0.810601 0.1070499 -0.0851531 -0.3052696 -0.2487966 -0.0384139 -0.1079604 0.0814525 -0.193546 -0.4295999 -0.0517038 0.0136481 0.0980194 -0.3349791 0.0626002 -0.0921864 0.0333229 -0.2117516 1.7430254 0.1141002 0.2690903 0.2716577 1.0630433 -0.2408447 0.2680755 -0.2537033 0.3443553 -0.1927083 0.0032263 -0.0490395 -0.0007409 -0.188813 0.0227255 0.035709 -0.0081199 -0.1117206 0.2832045 0.053539 0.0214933 0.0134359 0.6045145 -0.1092585 0.0655668 -0.170079 0.0589482 0.6954829 -0.0237112 0.1336696 0.1362853 -0.2280245 0.0283614 0.1658077 0.0271477 -0.0895034 0.7576656 -0.1405429 0.0241527 -0.1495693 0.2979431 0.019798 0.0934515 -0.0041843 0.3066029 -0.6602588 -0.0201555 -0.1105015 0.087306 0.1167724 -0.0317355 -0.1886826 -0.0276694 0.0350424 -0.0929391 -0.0980621 0.0083507 -0.0331125 -0.1078648 0.0432071 -0.0231585 0.0360503 0.0654131 -0.1568444 0.0122838 -0.0561627 0.0512809 -0.058494 0.0079771 -0.0556394 0.0192841 -0.0899524 0.1261439 0.0239292 -0.0367828 0.0041412 0.0968322 0.0370737 -0.0250467 0.0445548 0.2032307 -0.0112045 0.0054681 0.0037701 -0.0414796 0.04625 -0.0984656 0.0129073 -0.0402782 0.088688 0.0296783 -0.0031797 0.0594771 0.0441661 0.0315689 0.0766891 0.0194458 0.0280853 0.0795636 0.0659128 0.0948343 -0.0481659 0.0250148 0.0419612 0.037232 -0.0263814 0.0579505 0.1122739 -0.0308728 -0.0148887 0.0906531 0.0127673 0.0588303 -0.055508 0.1050334 -0.0247255 0.0493639 0.0497393 -0.0761464 -0.0584203 -0.071161 0.0612211 -0.0047811 -0.0838303 -0.0647288 -0.0713509 unknown
polarizability: 134.171966|4.2287212|94.7259649|2.738834|-8.5885876|63.2305336 unknown
InChI: InChI=1S/C6H6N4O2/c1-5-8-6(10(11)12)4-9(5)3-2-7/h4H,3H2,1H3
charge 0 multiplicity 1
18 atoms
O  2.953617 1.689606 -0.219356
O  3.555583 -0.364919 0.594999
N  -0.826952 -0.00426 -0.552932
N  0.879352 -1.25762 0.255149
N  2.694065 0.462467 0.123004
N  -3.791325 0.979208 1.072702
C  -0.430903 -1.267197 -0.04748
C  0.290235 0.829267 -0.550628
C  -2.184848 0.377902 -0.975798
C  1.319216 0.027617 -0.054125
C  -1.361554 -2.426697 0.11777
C  -3.070806 0.714179 0.161633
H  0.280162 1.863863 -0.877742
H  -2.638325 -0.452216 -1.546769
H  -2.123435 1.245308 -1.655227
H  -0.794598 -3.25575 0.56627
H  -2.211286 -2.188399 0.783886
H  -1.771798 -2.777963 -0.848157
