program: Gaussian 09
title: 000209345
version: EM64L-G09RevD.01
frameworkgroup: C1[X(C8H13N3O3)]
method: RPBEPBE
basis: SDD
operation: Freq
keyword: #p
keyword: freq=noraman
keyword: PBEPBE/SDD
title: #p freq=noraman PBEPBE/SDD
converged: YES YES NO NO
title: Mulliken charges:
elementType: O O O N N N C C C C C C C C H H H H H H H H H H H H H
charge: -0.293080 -0.211723 -0.248678 -0.189698 -0.090910 0.044476 -0.419109 -0.230188 0.265616 0.319880 -0.356006 -0.775083 -0.199559 -0.680162 0.263453 0.234735 0.228372 0.206749 0.289130 0.284422 0.231251 0.267147 0.198061 0.192802 0.210995 0.225912 0.231194
chargesum: 0.00000
title: Mulliken charges with hydrogens summed into heavy atoms:
elementType: O O O N N N C C C C C C C C
charge: -0.293080 -0.211723 -0.248678 -0.189698 -0.090910 0.044476 0.079079 0.204934 0.265616 0.319880 -0.066875 0.007737 0.191304 -0.012061
polarizability: 1.35972387e+02 -1.62992621e+01 1.36635721e+02 -1.78400052e+01 -7.83090923e+00 9.55646313e+01
1716.lowfreq: -13.1778 -6.0580 -0.0005 -0.0002 0.0006 3.2727 25.9407 50.4964 51.9668
frequency: 25.7627 50.4412 51.9632 65.1415 105.7341 121.7332 147.5869 164.9026 188.1660 212.5336 244.9907 273.7294 296.7236 336.0417 378.4307 402.9788 414.6761 498.5342 537.7671 601.3740 635.1828 676.3114 689.7208 719.9152 753.6416 791.0114 815.9634 866.8921 905.1144 940.5993 971.3723 983.8688 1036.4520 1053.9908 1071.2611 1087.2087 1117.5107 1135.1983 1142.7645 1173.1171 1188.3699 1227.1747 1251.8880 1254.6566 1311.7255 1326.0669 1328.4879 1350.7422 1358.2512 1388.6167 1393.8074 1403.4801 1408.0579 1452.5900 1462.3806 1466.0262 1467.6023 1471.5655 1479.4735 1482.9065 1492.4067 1494.2509 2928.4893 2941.8667 2980.3719 2985.4791 2994.7369 3005.3709 3055.6985 3069.2505 3093.5423 3100.8547 3122.6213 3127.2223 3251.3712
redmass: 4.2801 2.0253 5.0265 5.2919 4.2934 4.9120 3.3831 1.0438 3.2104 5.0534 1.1383 5.3817 3.7748 2.9268 4.1034 3.1145 3.7549 3.1730 3.9966 4.8290 4.1812 4.8316 7.8671 4.7201 7.1764 2.6108 1.0910 1.4329 2.7253 3.2449 1.9705 1.7761 2.8588 1.5088 4.2097 2.5436 2.4551 1.9010 1.7958 2.5561 1.5652 2.5490 1.4629 1.3470 4.4609 2.2410 2.9831 1.7203 1.3702 1.2602 1.2516 1.4002 3.3333 1.1667 1.0434 2.5348 1.3064 1.1890 1.6292 1.1871 1.7841 1.0826 1.0559 1.0592 1.1068 1.0403 1.0358 1.1012 1.0621 1.0952 1.0991 1.1013 1.1028 1.0984 1.0994
irintensity: 0.8321 1.8027 1.1954 2.3572 0.7777 3.7965 4.0709 0.2148 2.8993 2.8826 0.8082 7.7722 2.5785 2.7560 2.9655 2.3819 1.8980 9.4356 3.7338 1.1051 2.1112 7.9450 6.0242 2.1587 8.8966 7.8773 4.1089 20.9035 13.6634 10.0772 2.8235 2.4134 11.9198 11.4733 145.6170 5.1461 26.5541 17.3866 9.5390 188.4716 34.0675 30.3688 32.1745 17.8578 38.9765 199.3331 108.8236 8.7515 8.1488 12.0260 5.8996 13.3629 62.6876 22.7006 12.6751 135.7841 55.3147 21.7689 13.1468 1.8960 18.2745 9.3072 46.0433 75.3711 54.0119 12.1691 18.0435 27.0144 27.6988 3.5471 33.4534 36.5018 1.9568 2.4299 2.0492
temp: 298.150 k
press: 1.00000 atm
elementType: 8 8 8 7 7 7 6 6 6 6 6 6 6 6 1 1 1 1 1 1 1 1 1 1 1 1 1
symmnumber: 1
zpe: 561070.8 jmol-1
zpe.correction: 0.213701 hartree
zpe.thermalcorrener: 0.228318 hartree
zpe.thermalcorrenthalpy: 0.229262 hartree
zpe.thermalcorrgfe: 0.170448 hartree
zpe.sumelectzpe: -701.389668 hartree
zpe.sumelectthermal: -701.375051 hartree
zpe.sumelectthermalent: -701.374107 hartree
zpe.sumelectthermalfe: -701.432921 hartree
dipole: -5.2478 0.2540 2.0734
dipole: 5.6482
quadrupole: -88.3870 -90.7245 -78.8407
quadrupole: 8.8491 3.0035 3.2434
quadrupole: -2.4029 -4.7404 7.1434 8.8491 3.0035 3.2434
hfenergy: -701.603369 hartree
pointgroup: C01 [X(C8H13N3O3)]
dipole: 1.9165112 -0.4601117 1.0263406 debye
polarizability: 125.5442192|-8.3008701|143.7152758|23.0811196|-9.4438444|98.9132449 unknown
InChI: InChI=1S/C8H13N3O3/c1-3-14-5-4-10-7(2)9-6-8(10)11(12)13/h6H,3-5H2,1-2H3
charge 0 multiplicity 1
27 atoms
O  2.378073 -0.235223 0.137215
O  -2.788635 1.744516 -1.713929
O  -1.122117 2.484986 -0.323286
N  -0.581039 -0.255931 0.409978
N  -1.595201 -2.106215 -0.455812
N  -1.832963 1.530908 -0.865389
C  0.361627 0.561679 1.20728
C  1.606771 0.97802 0.417065
C  -0.641335 -1.645822 0.411523
C  -1.550358 0.175343 -0.523385
C  -2.159747 -0.985236 -1.033635
C  0.22998 -2.523233 1.25023
C  3.541697 0.01991 -0.731023
C  4.24979 -1.313508 -0.963593
H  -0.159174 1.463865 1.559479
H  0.671161 -0.043193 2.075559
H  1.317078 1.496362 -0.520121
H  2.202441 1.685587 1.035209
H  -2.954075 -1.041093 -1.77287
H  1.296609 -2.299564 1.073701
H  0.026936 -2.400138 2.331284
H  0.021665 -3.569082 0.979533
H  3.195722 0.462447 -1.690637
H  4.218949 0.751956 -0.238116
H  5.131257 -1.17061 -1.614427
H  4.589338 -1.746016 -0.006553
H  3.569846 -2.033615 -1.450678
