program: Gaussian 09
title: 000209339
version: EM64L-G09RevD.01
frameworkgroup: C1[X(C21H27NO2)]
method: RPBEPBE
basis: SDD
operation: Freq
keyword: #p
keyword: freq=noraman
keyword: PBEPBE/SDD
title: #p freq=noraman PBEPBE/SDD
converged: YES YES NO NO
title: Mulliken charges:
elementType: O O N C C C C C C C C C C C C C C C C C C C C C H H H H H H H H H H H H H H H H H H H H H H H H H H H
charge: -0.242135 -0.266703 -0.123952 0.047512 -0.485954 -0.346126 -0.334046 -0.586872 -0.781269 -0.330942 -0.330101 0.515538 -0.413323 -0.421359 0.474007 -0.410828 -0.378625 -0.476105 0.357758 -0.344873 -0.370416 -0.227979 -0.198632 -0.257122 0.195061 0.219605 0.233313 0.197086 0.213603 0.222463 0.187730 0.220834 0.237623 0.233912 0.224205 0.218050 0.214752 0.187968 0.189650 0.213847 0.232106 0.229941 0.230287 0.233150 0.212151 0.210915 0.250034 0.250048 0.221663 0.225873 0.226675
chargesum: 0.00000
title: Mulliken charges with hydrogens summed into heavy atoms:
elementType: O O N C C C C C C C C C C C C C C C C C C C C C
charge: -0.242135 -0.266703 -0.123952 0.242574 -0.033036 0.064564 0.076147 -0.128416 -0.105102 0.071778 0.073395 0.515538 -0.181217 -0.191418 0.474007 -0.180541 -0.145475 -0.053039 0.357758 -0.094839 -0.120368 -0.006316 0.027241 -0.030446
polarizability: 3.52008015e+02 -1.74284427e+01 2.00501857e+02 -8.02824598e-01 -3.31334650e+00 1.81351708e+02
1716.lowfreq: -20.9420 -13.5411 -5.7832 -3.4446 -0.0009 -0.0004 0.0008 11.9233 15.1220
frequency: -16.1450 9.7712 14.3365 19.4663 32.8515 34.4747 57.9199 82.1412 94.8359 115.8975 129.9792 180.4340 201.4535 211.3664 227.2798 236.6783 262.1376 290.0500 303.9272 342.1945 352.6195 375.5890 396.7498 405.2342 412.2772 426.2481 433.1647 447.2874 462.5098 489.4258 503.3709 529.0919 565.9018 581.2103 609.5286 632.7707 638.8205 692.2886 716.5564 730.6987 757.4342 770.0113 775.6718 808.6612 815.4530 821.7891 822.6754 842.8729 849.1249 858.4958 880.0941 887.4163 909.2813 932.2405 947.5133 957.3630 960.6849 962.6565 972.7310 977.7938 980.7182 982.8507 986.0475 1014.9819 1021.4782 1026.6423 1045.6885 1053.5069 1074.1508 1082.0620 1084.6377 1095.1500 1109.0900 1122.9464 1130.7330 1165.8637 1172.3640 1174.9559 1184.8152 1189.0262 1196.2182 1199.2800 1208.9283 1217.8559 1231.2707 1246.7879 1259.4168 1269.0409 1272.6575 1294.6870 1312.1322 1312.9815 1315.9726 1328.5614 1337.2921 1348.1911 1350.5549 1357.5545 1374.3233 1381.4601 1382.6905 1385.7877 1387.8009 1409.9878 1442.4457 1442.7213 1448.6751 1453.2635 1463.4595 1472.2600 1473.3831 1476.5050 1481.9949 1491.9364 1493.8406 1510.7100 1585.6256 1589.0946 1610.6548 1625.4319 2817.8429 2855.6603 2867.4866 2946.7984 2953.0727 2958.1899 2984.0588 2989.9710 2995.4727 3017.7118 3031.3463 3048.1658 3056.0923 3059.5964 3077.3870 3080.5729 3081.5870 3085.2718 3112.5846 3114.3187 3126.1564 3135.1741 3135.4532 3142.0083 3154.5748 3163.2796 3172.0048
redmass: 3.6444 5.2544 4.4206 3.7951 5.1388 3.1362 4.2495 4.7692 3.9171 2.8856 4.4166 4.6039 4.1930 1.7874 4.5469 1.7038 1.6323 2.3234 2.6300 3.5028 3.8801 2.4624 1.9342 2.8364 2.9314 3.0906 3.6297 3.5027 2.8346 4.2061 2.8641 3.7117 3.6553 2.0275 6.3915 3.6711 6.6054 2.0393 2.9220 2.8044 1.6613 4.1127 1.3106 2.8473 3.5804 1.5143 2.1705 1.5963 1.2520 3.2501 2.7373 1.4553 2.4203 5.6635 2.0168 1.5133 1.4378 1.6185 1.3897 1.9414 1.3296 5.8556 1.6237 2.8650 2.0815 2.1614 1.8967 1.9628 2.0979 1.5190 3.0007 2.0532 2.1520 1.9106 1.8759 1.1140 2.0918 1.2166 1.4548 1.1101 1.0893 1.1569 2.6444 2.2656 2.5699 1.4244 1.3862 1.2399 1.2348 1.1783 1.5192 1.3482 1.2555 1.3591 1.2990 1.3450 1.3357 1.4381 1.2862 1.3459 1.3850 4.8438 5.4050 2.7086 2.3705 1.0817 1.0784 1.0957 1.0930 1.0825 1.6502 1.0647 1.3430 1.0766 1.0763 2.8183 6.6688 6.3989 6.2650 6.5349 1.0811 1.0711 1.0699 1.0671 1.0668 1.0558 1.0403 1.0558 1.0614 1.1073 1.0983 1.0883 1.0896 1.1018 1.0953 1.0971 1.0986 1.0996 1.0873 1.0875 1.0847 1.0890 1.0962 1.0974 1.0926 1.0951 1.1003
irintensity: 0.4007 0.0357 0.2781 0.1077 0.4888 0.1110 0.1351 0.0503 3.2188 1.2983 0.4138 0.2835 2.4105 0.6623 0.8149 3.0049 0.0330 1.8657 13.5716 0.3451 1.2024 0.1335 0.4874 0.1350 0.0797 0.3415 0.8529 0.6768 1.3052 7.3065 11.9830 12.6311 7.3182 10.2392 1.0678 4.8723 0.1041 32.8398 5.9598 1.1498 87.5665 5.9398 2.4883 21.1718 35.2768 7.9695 16.3773 0.0923 0.0228 21.8697 47.5896 8.1398 15.2420 110.4123 21.9896 1.4548 0.8830 4.7644 0.0446 6.5727 0.1374 2.8395 10.6592 4.4555 18.5991 10.1947 6.6518 18.8705 10.0632 13.3432 31.6650 29.9656 1.5515 15.5522 2.5332 29.1327 29.9401 78.8141 13.4355 12.9319 2.6614 0.4879 262.4524 0.8742 23.5400 14.8672 42.7184 8.9991 13.7577 1.8750 12.6101 0.5786 0.3876 18.4313 0.6428 11.4872 2.9471 44.5736 3.9392 22.8808 9.8061 6.3691 21.7519 6.6827 3.0284 2.2386 1.8161 18.9760 6.3444 23.6234 91.8089 2.6760 17.7259 3.6319 21.7582 22.0177 0.3065 35.9569 97.4457 18.0954 66.7550 60.6642 140.7390 45.3368 90.3065 39.7342 12.8272 9.4861 45.9316 27.0973 7.6547 39.3851 23.4834 51.8253 43.3524 35.8896 39.0017 43.3840 2.2212 35.3833 4.3439 13.5640 38.0457 0.5873 39.1659 21.6980 6.1631
temp: 298.150 k
press: 1.00000 atm
elementType: 8 8 7 6 6 6 6 6 6 6 6 6 6 6 6 6 6 6 6 6 6 6 6 6 1 1 1 1 1 1 1 1 1 1 1 1 1 1 1 1 1 1 1 1 1 1 1 1 1 1 1
symmnumber: 1
zpe: 1136820.1 jmol-1
zpe.correction: 0.432992 hartree
zpe.thermalcorrener: 0.454998 hartree
zpe.thermalcorrenthalpy: 0.455943 hartree
zpe.thermalcorrgfe: 0.377348 hartree
zpe.sumelectzpe: -1019.794102 hartree
zpe.sumelectthermal: -1019.772095 hartree
zpe.sumelectthermalent: -1019.771151 hartree
zpe.sumelectthermalfe: -1019.849745 hartree
dipole: -0.3216 2.1334 -0.3200
dipole: 2.1811
quadrupole: -145.4319 -144.3631 -141.3434
quadrupole: -12.8582 -9.0267 -1.1224
quadrupole: -1.7191 -0.6503 2.3694 -12.8582 -9.0267 -1.1224
hfenergy: -1020.2270937 hartree
pointgroup: C01 [X(C21H27N1O2)]
dipole: -0.1255603 0.8167287 -0.231403 debye
polarizability: 351.8669105|-18.1015964|199.4925977|-0.4205506|-5.4548759|182.5020723 unknown
InChI: InChI=1S/C21H27NO2/c1-18(22-13-15-23-16-14-22)7-8-19-9-11-20(12-10-19)17-24-21-5-3-2-4-6-21/h2-6,9-12,18H,7-8,13-17H2,1H3
charge 0 multiplicity 1
51 atoms
O  -6.770617 -2.377771 -0.053564
O  3.908433 -0.059659 0.15452
N  -5.075859 -0.01722 0.35691
C  -4.380884 1.050928 1.150708
C  -2.843906 1.015957 0.920933
C  -4.626583 -1.3887 0.729895
C  -6.560935 0.048517 0.458872
C  -2.420403 1.186394 -0.565014
C  -4.943008 2.454163 0.82073
C  -5.30579 -2.44468 -0.156656
C  -7.211757 -1.025318 -0.42726
C  -0.921744 1.012287 -0.748213
C  -0.031221 2.103178 -0.573251
C  -0.368217 -0.257317 -1.060915
C  1.909796 0.661062 -1.010543
C  1.363735 1.930923 -0.701746
C  1.025378 -0.431166 -1.192336
C  3.40125 0.469919 -1.139222
C  5.283359 -0.342234 0.237999
C  6.213962 -0.143573 -0.813876
C  5.717041 -0.859894 1.485647
C  7.575403 -0.468187 -0.603998
C  7.075494 -1.17719 1.677505
C  8.015369 -0.98422 0.633945
H  -4.546517 0.867138 2.246712
H  -2.392235 1.82338 1.529944
H  -2.412812 0.075106 1.311853
H  -4.852055 -1.610161 1.804238
H  -3.534611 -1.47493 0.590895
H  -6.91217 1.036136 0.114709
H  -6.90362 -0.092302 1.516156
H  -2.729545 2.188458 -0.917563
H  -2.980957 0.449158 -1.168674
H  -4.989316 2.612938 -0.271657
H  -5.952145 2.613921 1.237928
H  -4.284191 3.227019 1.255921
H  -5.031884 -3.463213 0.165242
H  -4.998509 -2.29322 -1.214899
H  -6.956167 -0.829563 -1.491601
H  -8.307583 -1.026241 -0.303722
H  -0.437061 3.095627 -0.340273
H  -1.03956 -1.111739 -1.213617
H  2.035437 2.78631 -0.559124
H  1.433531 -1.420012 -1.434108
H  3.911192 1.429203 -1.360904
H  3.645938 -0.257832 -1.939817
H  5.899857 0.256704 -1.782303
H  4.976521 -1.002151 2.278921
H  8.292252 -0.313683 -1.418717
H  7.402758 -1.576764 2.644039
H  9.070854 -1.232592 0.78655
