program: Gaussian 09
title: 000209335
version: EM64L-G09RevD.01
frameworkgroup: C1[X(C21H27NO)]
method: RPBEPBE
basis: SDD
operation: Freq
keyword: #p
keyword: freq=noraman
keyword: PBEPBE/SDD
title: #p freq=noraman PBEPBE/SDD
converged: YES YES NO NO
title: Mulliken charges:
elementType: O N C C C C C C C C C C C C C C C C C C C C C H H H H H H H H H H H H H H H H H H H H H H H H H H H
charge: -0.285737 -0.067205 -0.354431 -0.364735 -0.399644 -0.391946 -0.397364 -0.327903 -0.402444 -0.566040 0.505759 -0.412581 -0.410829 0.425875 -0.432286 -0.384274 -0.431055 0.380682 -0.346337 -0.381935 -0.226722 -0.197916 -0.256705 0.211598 0.163804 0.164670 0.209661 0.191063 0.205458 0.204210 0.190217 0.212827 0.187714 0.201246 0.171288 0.225079 0.217067 0.203158 0.202449 0.232803 0.231891 0.226040 0.256638 0.220895 0.221146 0.249055 0.249247 0.222678 0.226500 0.227371
chargesum: 0.00000
title: Mulliken charges with hydrogens summed into heavy atoms:
elementType: O N C C C C C C C C C C C C C C C C C C C C C
charge: -0.285737 -0.067205 0.020971 0.009595 -0.003124 0.002480 0.003177 0.044632 0.039702 -0.160433 0.505759 -0.179777 -0.178938 0.425875 -0.206246 -0.127636 0.010986 0.380682 -0.097282 -0.132687 -0.004044 0.028584 -0.029334
polarizability: 3.40585531e+02 -2.15614140e+01 2.02077870e+02 1.07042208e+01 2.85751875e+01 1.73492069e+02
1716.lowfreq: -9.1647 -3.4305 -0.0015 -0.0010 0.0009 1.1076 5.2185 17.2816 20.9892
frequency: -6.5433 17.0439 20.9360 25.3305 36.7750 56.2976 63.4505 84.9668 99.5776 117.3064 152.3518 168.9556 203.1507 225.6275 235.1699 251.0911 267.0224 300.9302 333.8672 348.6549 384.9656 402.9662 411.4664 415.5341 445.1704 448.5783 466.3931 496.4666 503.6181 545.1925 562.3255 608.5882 614.2489 637.2468 691.9780 720.9127 747.8872 756.7468 757.4552 778.1265 805.0711 808.8071 817.8460 823.1734 843.6407 849.4668 853.5750 858.1984 862.1585 887.8117 909.1834 951.1680 959.6227 959.8699 971.8304 977.1081 981.3018 985.3422 991.8977 1010.6203 1016.0716 1022.7627 1026.6755 1041.5198 1050.8574 1059.7321 1082.9107 1084.2342 1108.1115 1123.1247 1125.3759 1152.0044 1155.0964 1165.2079 1166.8193 1178.3903 1188.7606 1201.7843 1215.5840 1218.8503 1223.3714 1230.1377 1256.8312 1261.1464 1266.7279 1277.0961 1287.8353 1299.0793 1309.4089 1315.0953 1329.6497 1330.6829 1339.9430 1343.8322 1350.0828 1350.8179 1373.2940 1385.9442 1392.2048 1394.0167 1411.6911 1442.8011 1451.3813 1458.9649 1459.7944 1465.1615 1468.0077 1469.8213 1471.5416 1479.3094 1483.1689 1488.7549 1510.0690 1585.5959 1591.0879 1612.0003 1627.5345 2808.2409 2808.6301 2828.4868 2933.6671 2965.9639 2971.8392 2984.2946 2986.2582 2991.8019 2994.4214 2999.0734 3018.5906 3021.7214 3032.7366 3043.4176 3045.6739 3054.5965 3062.1435 3108.0334 3117.1688 3127.2426 3133.2770 3135.9902 3154.9200 3162.9955 3163.1980 3172.2677
redmass: 4.0130 4.7838 3.7350 2.9019 4.9086 4.3864 3.2078 2.6503 3.3456 3.1549 4.6176 2.7103 3.7866 4.2295 1.8375 3.3090 3.9437 2.0319 3.6480 2.6936 1.9032 2.8518 2.9181 3.0181 3.4296 3.0527 3.8730 3.3485 2.8761 3.6523 1.9921 5.8914 4.8302 6.8349 2.0374 3.2973 3.6266 1.1122 1.6564 4.1497 1.5715 4.0604 1.7117 1.3829 1.5795 1.9437 1.4717 2.0444 1.5783 1.4529 2.2716 1.3721 1.2965 1.3596 6.7980 1.3758 1.3016 6.2936 2.5783 1.9676 2.4545 2.0672 3.7622 2.1488 1.7612 2.0865 1.5302 1.6178 2.0508 2.4585 1.4089 1.2610 2.2940 1.3361 1.0848 1.1752 1.1150 1.1550 2.7397 2.3793 1.7799 2.3331 1.2771 1.3475 1.1894 1.3097 1.1569 1.3865 1.3091 1.3333 1.3982 1.3076 1.4306 1.4648 1.5278 1.6350 1.3733 7.1166 3.9820 1.4316 2.4904 2.3483 1.0902 1.0801 1.0876 1.0920 1.3194 1.0859 1.0873 1.0985 1.6947 1.1001 2.7484 6.6517 6.4598 6.2474 6.4428 1.0713 1.0709 1.0694 1.0576 1.0624 1.0590 1.0619 1.0610 1.0708 1.1029 1.0749 1.0870 1.1011 1.0956 1.0903 1.1008 1.1032 1.1036 1.0871 1.0897 1.0848 1.0965 1.0890 1.0925 1.0947 1.0951 1.1006
irintensity: 0.4996 0.2856 0.6504 0.2480 0.0564 0.0412 0.1948 0.7765 2.4850 1.4497 0.9853 2.7288 0.5898 1.7615 1.3933 1.7741 0.4094 3.0157 0.5241 0.2323 1.5893 0.9406 0.4860 3.4339 1.3219 0.3725 1.8061 6.7108 13.8488 16.7646 3.8546 1.4834 4.6688 0.1107 31.6839 2.9965 10.6135 4.7004 83.7107 4.7325 1.1041 17.1850 32.1060 4.2829 5.3961 7.9578 4.8697 18.1191 1.5541 10.1351 2.4715 4.2721 2.4050 0.0270 67.9041 0.3668 0.6375 19.2946 17.6844 0.4096 8.2753 25.0220 7.1261 6.2072 14.5969 1.2240 12.8172 14.9581 28.1540 6.4767 9.5788 5.6575 24.1251 10.2114 13.2634 52.5078 13.4616 10.0958 214.0675 5.0697 27.4286 61.3303 2.5902 5.2990 9.8146 2.8215 1.7807 14.3154 5.3213 3.7358 2.6524 5.4866 1.3785 15.1589 1.2683 25.5587 5.3116 2.9263 24.2932 1.9735 10.7050 2.2121 6.9693 3.6042 13.7483 10.7032 99.6375 0.5417 1.2378 2.1026 41.2508 13.6131 38.1232 4.2777 27.2984 94.1581 3.4005 46.6900 37.2250 244.0105 30.9108 39.6974 30.5374 35.0573 37.4551 7.4103 30.2431 35.8059 73.6806 3.7996 72.3608 40.2461 5.8379 104.2441 51.1340 16.1537 22.3941 4.0933 22.8500 12.4387 37.0849 3.8877 23.2719 6.2157
temp: 298.150 k
press: 1.00000 atm
elementType: 8 7 6 6 6 6 6 6 6 6 6 6 6 6 6 6 6 6 6 6 6 6 6 1 1 1 1 1 1 1 1 1 1 1 1 1 1 1 1 1 1 1 1 1 1 1 1 1 1 1
symmnumber: 1
zpe: 1127578.9 jmol-1
zpe.correction: 0.429472 hartree
zpe.thermalcorrener: 0.450365 hartree
zpe.thermalcorrenthalpy: 0.451310 hartree
zpe.thermalcorrgfe: 0.376277 hartree
zpe.sumelectzpe: -944.672781 hartree
zpe.sumelectthermal: -944.651888 hartree
zpe.sumelectthermalent: -944.650944 hartree
zpe.sumelectthermalfe: -944.725976 hartree
dipole: 0.8062 -1.1314 0.1527
dipole: 1.3976
quadrupole: -124.9042 -133.6329 -137.6279
quadrupole: 2.1750 7.3385 7.5393
quadrupole: 7.1508 -1.5779 -5.5729 2.1750 7.3385 7.5393
hfenergy: -945.1022536 hartree
pointgroup: C01 [X(C21H27N1O1)]
dipole: 0.3256426 -0.4424072 -0.0239988 debye
polarizability: 341.6302244|-19.4570328|190.6716305|3.0499426|32.2545407|183.853616 unknown
InChI: InChI=1S/C21H27NO/c1-3-9-21(10-4-1)23-18-20-13-11-19(12-14-20)8-7-17-22-15-5-2-6-16-22/h1,3-4,9-14H,2,5-8,15-18H2
charge 0 multiplicity 1
50 atoms
O  -3.907999 0.179747 0.261096
N  5.512606 0.200203 -0.187521
C  5.348072 1.478744 0.551725
C  6.940393 -0.213141 -0.226533
C  6.176579 2.609152 -0.093203
C  7.816752 0.861023 -0.901427
C  7.669086 2.218705 -0.177986
C  4.645945 -0.884399 0.336727
C  3.14439 -0.665488 0.058232
C  2.294596 -1.894992 0.486404
C  0.80823 -1.682643 0.243515
C  0.221082 -1.997661 -1.008302
C  -0.022658 -1.114555 1.243719
C  -1.969983 -1.191121 -0.245049
C  -1.147188 -1.750121 -1.252787
C  -1.393013 -0.873562 1.008336
C  -3.450399 -0.993673 -0.503128
C  -5.277222 0.492203 0.215249
C  -6.238801 -0.215647 -0.549173
C  -5.668264 1.605309 1.001693
C  -7.591106 0.199891 -0.514902
C  -7.018019 2.005907 1.023905
C  -7.990175 1.305566 0.26643
H  4.27968 1.757405 0.551171
H  5.661191 1.359548 1.625362
H  7.334346 -0.406441 0.808555
H  7.008589 -1.165268 -0.786306
H  6.047508 3.538573 0.494549
H  5.785332 2.798333 -1.111502
H  7.498459 0.967334 -1.95653
H  8.872906 0.528439 -0.89991
H  8.248001 3.003663 -0.700618
H  8.086562 2.136218 0.847339
H  4.958666 -1.825225 -0.159303
H  4.797502 -1.038836 1.439673
H  3.006385 -0.469399 -1.021868
H  2.767929 0.225513 0.595916
H  2.476933 -2.098141 1.560512
H  2.648053 -2.783929 -0.073001
H  0.843015 -2.433879 -1.799948
H  0.410162 -0.861911 2.220038
H  -1.574867 -1.99351 -2.233933
H  -2.021509 -0.425035 1.783826
H  -4.031279 -1.882148 -0.171878
H  -3.640933 -0.839894 -1.585171
H  -5.955368 -1.072681 -1.167028
H  -4.903276 2.134797 1.578193
H  -8.332629 -0.349025 -1.106611
H  -7.313352 2.867201 1.633614
H  -9.03891 1.619752 0.286238
