program: Gaussian 09
title: 000209333
version: EM64L-G09RevD.01
frameworkgroup: C1[X(C20H27NO)]
method: RPBEPBE
basis: SDD
operation: Freq
keyword: #p
keyword: freq=noraman
keyword: PBEPBE/SDD
title: #p freq=noraman PBEPBE/SDD
converged: YES YES NO NO
title: Mulliken charges:
elementType: O N C C C C C C C C C C C C C C C C C C C C H H H H H H H H H H H H H H H H H H H H H H H H H H H
charge: -0.286635 -0.104469 -0.339368 -0.391304 -0.562238 -0.321786 -0.323050 0.509939 -0.673762 -0.677526 -0.410045 -0.412597 0.420418 -0.427231 -0.387498 -0.427262 0.382207 -0.346348 -0.382514 -0.226869 -0.197896 -0.256680 0.180411 0.198173 0.207784 0.228914 0.202101 0.200488 0.202710 0.184547 0.206399 0.184193 0.205186 0.228869 0.207510 0.205339 0.229576 0.206472 0.232122 0.231269 0.225305 0.258001 0.221254 0.221087 0.249077 0.249127 0.222686 0.226532 0.227386
chargesum: 0.00000
title: Mulliken charges with hydrogens summed into heavy atoms:
elementType: O N C C C C C C C C C C C C C C C C C C C C
charge: -0.286635 -0.104469 0.039216 0.045394 -0.159649 0.065471 0.067543 0.509939 -0.032196 -0.036139 -0.177923 -0.181328 0.420418 -0.201926 -0.129497 0.015078 0.382207 -0.097272 -0.133387 -0.004183 0.028636 -0.029294
polarizability: 3.31684069e+02 -1.69814329e+01 2.05261025e+02 1.19324512e+01 2.81606616e+01 1.59257671e+02
1716.lowfreq: -8.5688 -3.9473 -0.0015 -0.0006 0.0002 2.2520 7.1317 16.6406 20.0545
frequency: 4.7514 16.6324 20.0099 21.3133 39.0372 50.3627 67.5527 76.0200 79.4918 94.6868 108.6584 145.0275 155.5677 187.1936 204.3261 221.4837 228.7205 265.4156 272.4144 289.0634 317.7075 346.5312 356.5493 403.5013 411.5809 419.2378 449.3220 464.2261 472.2227 503.3406 509.9876 545.0333 607.4896 612.5743 636.9332 691.8130 719.9737 735.4841 748.9479 757.4887 775.7011 794.7787 796.2020 810.3753 817.8631 823.2086 843.6938 850.0976 855.3327 887.9565 918.1246 951.6567 959.9201 973.6745 977.6837 981.4057 984.5437 986.0024 1011.9410 1016.1119 1023.0867 1027.3545 1045.0513 1047.3207 1074.0460 1079.4851 1083.3404 1085.6928 1094.4713 1125.1993 1145.3438 1166.9183 1178.4089 1187.1332 1203.7706 1206.2164 1214.1021 1215.2456 1218.0403 1230.0629 1251.9947 1269.8700 1278.8031 1289.7570 1294.2397 1308.3652 1314.8680 1327.6846 1352.1685 1358.5398 1363.0551 1376.3373 1385.4021 1385.9604 1387.2899 1392.9463 1411.0895 1443.1372 1459.7399 1462.4099 1466.9273 1468.7772 1470.3992 1476.5169 1478.7570 1483.6992 1485.7067 1488.1722 1490.5668 1510.3156 1585.1652 1591.2063 1612.2753 1627.5554 2834.3110 2842.6716 2856.9517 2933.4759 2970.2710 2980.5172 2981.7193 2992.1174 2993.8350 3017.6168 3022.5258 3029.5700 3034.6389 3060.9684 3071.8275 3073.7878 3091.2255 3091.6642 3107.7732 3118.0878 3127.7301 3133.1729 3136.5336 3155.1909 3163.5927 3163.8289 3172.6878
redmass: 3.9640 3.5008 4.0811 3.8966 4.4411 3.7143 2.7699 2.3304 2.8149 2.5218 2.5627 2.4318 3.0943 2.0053 1.4374 2.1170 4.2889 3.3298 2.0385 2.1629 2.7558 3.0479 2.7837 2.8617 2.9322 3.0512 3.3116 3.2098 3.3859 2.8691 3.6406 3.6136 5.5795 5.5715 6.8478 2.0482 3.3030 2.6006 1.1770 1.6554 3.0228 1.1663 1.4061 3.3990 1.6617 1.3857 1.3773 2.4119 1.3718 1.4525 1.8619 1.3634 1.3621 6.7184 1.3751 1.3015 2.3364 6.3463 2.2255 2.1091 2.0676 3.9347 2.6289 1.6763 1.9109 2.5633 1.5226 2.1288 1.6808 1.3590 1.4671 1.0862 1.1760 1.1198 2.2493 1.1863 1.8661 2.6662 2.6106 2.2885 1.3084 1.2236 1.1233 1.2304 1.2566 1.3170 1.3354 1.4582 1.7652 1.3382 1.3470 1.4090 1.2448 6.4515 1.2358 3.7580 2.4341 2.3531 1.0599 1.0537 1.0743 1.3354 1.0570 1.0789 1.0541 1.6736 1.0765 1.0881 1.0754 2.7380 6.6279 6.4476 6.2585 6.4343 1.0715 1.0722 1.0712 1.0578 1.0593 1.0359 1.0359 1.0613 1.1027 1.0920 1.0933 1.0871 1.0874 1.1033 1.0985 1.0980 1.1002 1.1002 1.0869 1.0895 1.0847 1.0965 1.0890 1.0925 1.0951 1.0948 1.1005
irintensity: 0.2466 0.0880 0.3133 0.9177 0.0494 0.1281 0.2380 0.1465 0.0939 2.3127 2.0645 0.2606 1.3201 3.3498 0.5985 1.2067 0.5758 0.2817 2.2053 0.6213 2.2344 0.3677 0.3434 0.8069 0.1195 6.4686 1.6229 5.2444 0.8919 10.3707 16.8837 15.7488 3.2381 2.7673 0.0937 31.1407 3.5901 10.0361 2.5711 86.1606 2.2612 7.4636 15.6443 10.6591 32.8068 5.6077 0.3896 15.7113 7.0967 10.0335 0.6414 2.3047 0.0740 59.8924 0.2771 0.6509 5.9207 25.2500 0.1614 6.8205 27.3548 15.5540 3.4468 9.5773 20.6674 34.5209 13.6104 5.0966 26.5616 2.3167 16.9019 14.0797 52.4023 13.3413 28.6527 13.1441 26.8569 206.8694 12.4491 66.3362 2.5466 2.1159 2.4697 22.2144 24.8378 5.7218 3.5256 0.5712 27.4302 5.2224 7.8379 1.8578 22.5543 1.4033 21.7366 25.0904 12.3799 2.1714 2.8781 6.3296 1.3472 102.9517 1.2810 0.5527 5.2500 38.1161 8.9563 15.6148 11.7823 40.5818 4.4859 27.2768 93.1582 3.5543 44.9264 38.0592 254.2461 30.3858 31.9996 34.1709 31.9728 27.7833 31.1105 19.5055 5.5143 16.6304 18.9292 46.4259 48.9016 89.1797 24.7794 58.0203 16.2531 22.5617 3.8205 22.7187 12.4815 37.6665 12.4375 14.2471 6.0135
temp: 298.150 k
press: 1.00000 atm
elementType: 8 7 6 6 6 6 6 6 6 6 6 6 6 6 6 6 6 6 6 6 6 6 1 1 1 1 1 1 1 1 1 1 1 1 1 1 1 1 1 1 1 1 1 1 1 1 1 1 1
symmnumber: 1
zpe: 1103149.7 jmol-1
zpe.correction: 0.420168 hartree
zpe.thermalcorrener: 0.443158 hartree
zpe.thermalcorrenthalpy: 0.444102 hartree
zpe.thermalcorrgfe: 0.361614 hartree
zpe.sumelectzpe: -906.617614 hartree
zpe.sumelectthermal: -906.594623 hartree
zpe.sumelectthermalent: -906.593679 hartree
zpe.sumelectthermalfe: -906.676167 hartree
dipole: 1.0058 -1.1818 0.3858
dipole: 1.5991
quadrupole: -118.5154 -126.5025 -135.5546
quadrupole: 2.8205 6.6460 7.6676
quadrupole: 8.3421 0.3550 -8.6971 2.8205 6.6460 7.6676
hfenergy: -907.0377811 hartree
pointgroup: C01 [X(C20H27N1O1)]
dipole: 0.4069818 0.4778951 -0.042346 debye
polarizability: 332.6215594|15.5787426|190.4264693|-5.148335|35.613597|173.1547365 unknown
InChI: InChI=1S/C20H27NO/c1-3-21(4-2)16-8-9-18-12-14-19(15-13-18)17-22-20-10-6-5-7-11-20/h5-7,10-15H,3-4,8-9,16-17H2,1-2H3
charge 0 multiplicity 1
49 atoms
O  -3.528785 -0.165061 -0.209911
N  5.889069 -0.776674 0.073217
C  5.108555 0.352304 -0.49652
C  3.599352 0.257024 -0.185555
C  2.796134 1.418698 -0.834994
C  7.297855 -0.407821 0.379325
C  5.784265 -2.011526 -0.751116
C  1.307885 1.338074 -0.531685
C  7.430666 0.439495 1.659481
C  6.03412 -3.299271 0.057147
C  0.775881 1.883165 0.664877
C  0.416525 0.672012 -1.411791
C  -1.480291 1.106289 0.080421
C  -0.596936 1.76448 0.970622
C  -0.958864 0.557945 -1.115888
C  -2.961903 1.050908 0.396264
C  -4.914896 -0.363881 -0.091243
C  -5.794167 0.500952 0.608249
C  -5.414579 -1.527096 -0.729488
C  -7.173994 0.191009 0.658002
C  -6.790489 -1.820919 -0.66975
C  -7.681091 -0.9634 0.023591
H  5.254906 0.435726 -1.605666
H  5.493575 1.294524 -0.062586
H  3.190682 -0.707535 -0.544392
H  3.460149 0.265817 0.911563
H  2.960186 1.396726 -1.930793
H  3.206941 2.381482 -0.469789
H  7.86897 -1.34332 0.521073
H  7.776563 0.126358 -0.481534
H  4.760614 -2.053894 -1.166335
H  6.478581 -1.974355 -1.630411
H  8.493585 0.666509 1.865928
H  7.00996 -0.109282 2.51986
H  6.89372 1.402123 1.576323
H  5.915302 -4.190006 -0.588061
H  5.315193 -3.366615 0.891988
H  7.053323 -3.329973 0.483486
H  1.444018 2.399856 1.36525
H  0.805513 0.240608 -2.342791
H  -0.981235 2.18769 1.907709
H  -1.634211 0.033563 -1.798688
H  -3.487838 1.936159 -0.023696
H  -3.126645 1.040244 1.493429
H  -5.426692 1.399717 1.112174
H  -4.711692 -2.178169 -1.25858
H  -7.851672 0.861123 1.199274
H  -7.169894 -2.721618 -1.165266
H  -8.750411 -1.194766 0.06768
