program: Gaussian 09
title: 000209332
version: EM64L-G09RevD.01
frameworkgroup: C1[X(C23H31NO)]
method: RPBEPBE
basis: SDD
operation: Freq
keyword: #p
keyword: freq=noraman
keyword: PBEPBE/SDD
title: #p freq=noraman PBEPBE/SDD
converged: YES YES NO NO
title: Mulliken charges:
elementType: O N C C C C C C C C C C C C C C C C C C C C C C C H H H H H H H H H H H H H H H H H H H H H H H H H H H H H H H
charge: -0.286479 -0.126465 0.037448 -0.466789 -0.416055 -0.408919 -0.397012 -0.385005 -0.339597 -0.670664 -0.408284 -0.560682 0.511017 -0.417780 -0.405901 -0.428449 -0.387995 0.422934 -0.429246 0.381816 -0.346665 -0.382280 -0.226846 -0.197988 -0.256696 0.168356 0.202989 0.213272 0.189566 0.206311 0.191239 0.198035 0.197004 0.189703 0.191530 0.196536 0.179605 0.205783 0.248127 0.220947 0.185890 0.229401 0.210388 0.201565 0.202940 0.232161 0.231119 0.225447 0.257781 0.221149 0.220953 0.249145 0.249199 0.222655 0.226467 0.227320
chargesum: 0.00000
title: Mulliken charges with hydrogens summed into heavy atoms:
elementType: O N C C C C C C C C C C C C C C C C C C C C C C C
charge: -0.286479 -0.126465 0.205804 -0.050528 -0.020178 -0.019645 -0.010305 0.003061 0.045791 -0.015700 0.031505 -0.156178 0.511017 -0.185619 -0.174782 -0.203002 -0.130214 0.422934 0.012856 0.381816 -0.097521 -0.133081 -0.004191 0.028480 -0.029376
polarizability: 3.80472042e+02 -1.24587908e+01 2.30222541e+02 2.29276057e+01 1.84140194e+01 1.77287577e+02
1716.lowfreq: -16.7488 -1.1776 -0.0014 0.0014 0.0018 2.3790 10.2445 13.8858 15.9496
frequency: -12.8603 10.7672 15.6675 21.7757 37.1629 41.1752 54.6112 64.9966 90.5566 98.1907 111.5921 140.9016 152.0149 201.4167 213.6137 227.9529 239.7232 244.2220 271.3592 283.3610 303.6007 340.8036 350.7640 358.5207 392.0145 403.4894 412.4056 418.7437 433.6077 452.8429 462.1789 478.8050 502.3183 504.0107 547.8447 563.2402 603.2441 611.0914 637.0066 691.8410 729.7893 744.1946 757.1954 759.1676 774.3750 784.8421 797.1379 821.7893 826.0713 840.0409 842.4139 844.4932 853.5833 862.5373 888.2659 888.6355 894.4641 924.7336 950.5143 960.2177 972.7647 974.5298 976.9635 981.9130 985.6821 1011.7965 1015.2206 1020.5764 1023.2836 1028.1459 1045.2565 1046.6161 1058.8398 1060.3222 1080.1174 1084.3068 1095.5813 1107.8877 1116.3815 1129.2544 1148.5063 1166.2632 1166.9148 1180.2440 1188.4445 1201.5273 1214.0177 1215.3793 1217.8383 1228.7189 1230.2612 1240.8655 1253.7865 1254.5272 1260.3444 1272.5628 1300.3985 1302.2958 1309.4122 1313.7672 1316.2588 1326.1982 1331.3100 1339.2823 1339.9072 1343.1510 1351.6316 1361.8732 1376.6153 1386.1508 1392.5509 1411.5589 1435.2365 1443.6417 1459.3571 1462.3678 1463.5022 1464.5263 1468.8891 1469.2640 1473.3215 1477.0671 1477.2525 1483.9740 1485.9216 1492.5460 1510.2979 1585.2131 1591.8289 1612.3583 1627.5283 2803.1623 2836.8086 2851.0320 2932.8093 2964.1099 2965.3870 2969.0603 2970.5163 2971.3791 2982.1354 2992.9440 2993.8301 3019.4492 3025.5000 3027.2834 3031.9661 3036.5675 3039.1921 3041.3787 3048.8948 3062.2435 3093.0469 3108.1011 3117.7722 3127.6874 3133.4685 3136.4727 3155.1927 3163.2504 3163.6920 3172.6285
redmass: 3.7194 4.6317 4.2303 3.7639 3.9335 4.2918 3.7461 3.2884 2.5094 3.5738 2.7789 3.9951 3.1269 1.9265 2.9579 4.6211 1.7696 3.6144 3.4255 1.8301 2.1822 2.8997 2.3483 2.5288 2.7314 2.8733 2.9367 2.8869 3.0784 3.2340 3.4039 1.9312 3.0066 3.0720 3.3091 2.4477 5.7829 6.3444 6.8549 2.0616 3.2768 1.1133 1.9194 2.3982 2.5304 1.4524 4.1949 1.3195 2.4900 1.7405 2.3091 2.2076 1.3345 1.7263 1.5293 1.8088 1.4909 2.1065 1.3713 1.3621 6.3818 2.4999 1.3760 1.3008 6.3118 2.0225 2.4163 2.6426 2.0699 3.0515 1.6380 1.5230 1.7859 1.7885 1.5024 1.5245 1.3384 2.0904 1.9576 1.3372 2.2408 1.5048 1.0852 1.1723 1.1226 1.1548 2.0050 2.6731 2.4183 1.9430 2.3042 1.3185 1.3206 1.2979 1.2532 1.2163 1.2065 1.2284 1.3216 1.3134 1.3352 1.4567 1.5072 1.4988 1.4618 1.4903 1.7190 1.4053 1.4282 6.7869 3.9347 2.4809 1.1615 2.3523 1.0836 1.0878 1.0892 1.0818 1.3203 1.0811 1.0766 1.0743 1.0861 1.6921 1.0883 1.0680 2.7247 6.6396 6.4040 6.2460 6.4203 1.0800 1.0697 1.0604 1.0578 1.0626 1.0617 1.0637 1.0624 1.0589 1.0618 1.0609 1.1025 1.0988 1.0976 1.0950 1.0905 1.0993 1.0724 1.1002 1.1019 1.1022 1.0994 1.0870 1.0895 1.0847 1.0964 1.0890 1.0925 1.0945 1.0952 1.1005
irintensity: 0.2575 0.3970 0.0856 1.0313 0.1640 0.0259 0.0009 0.1027 0.5202 3.6163 0.3112 2.4200 1.2286 0.3771 0.9241 1.6437 0.5198 0.9547 2.9305 0.8657 1.7477 1.4551 0.5808 0.9996 2.3139 1.0331 0.1130 0.4117 0.0687 3.0863 1.5456 1.0221 1.7742 15.8194 11.8950 23.7907 1.2039 0.8458 0.0956 30.7020 2.0308 4.1777 48.5353 42.1341 5.3730 0.3491 24.7609 6.1844 18.4109 27.3242 10.8547 4.0606 9.2168 6.1390 10.0131 0.4432 9.8763 0.2009 4.4621 0.1033 56.3510 27.5529 0.8224 0.6883 23.5892 0.1998 3.5728 55.3519 16.6944 9.9596 5.4988 10.7199 9.4205 11.3471 6.1583 14.0073 5.4800 12.8553 9.7456 5.4525 4.7597 12.6187 12.8146 51.7166 15.0270 9.9917 6.2568 216.9160 6.2834 29.1669 60.0502 0.2312 1.6930 3.6083 4.5593 3.5870 5.2166 10.5667 6.5154 0.5721 4.4873 2.2620 3.4221 5.9405 6.8804 5.7497 25.3015 15.1558 5.2675 2.1628 26.7790 11.6960 6.0353 2.6592 3.1783 11.4152 2.0803 3.9194 100.4118 21.0995 7.6599 1.2033 5.5260 40.1261 4.3743 17.1969 41.6365 3.3077 28.1453 96.6280 4.8487 67.9117 55.1966 185.5672 28.6196 37.0186 44.3426 39.0189 19.9156 30.1566 32.5606 26.7991 33.2197 8.4669 79.5623 73.5309 12.3784 12.9646 44.9518 23.5593 116.9077 60.2158 38.5991 16.7368 22.6723 3.7889 22.9576 12.5574 38.1390 2.3591 24.6295 5.9650
temp: 298.150 k
press: 1.00000 atm
elementType: 8 7 6 6 6 6 6 6 6 6 6 6 6 6 6 6 6 6 6 6 6 6 6 6 6 1 1 1 1 1 1 1 1 1 1 1 1 1 1 1 1 1 1 1 1 1 1 1 1 1 1 1 1 1 1 1
symmnumber: 1
zpe: 1273502.3 jmol-1
zpe.correction: 0.485051 hartree
zpe.thermalcorrener: 0.508642 hartree
zpe.thermalcorrenthalpy: 0.509586 hartree
zpe.thermalcorrgfe: 0.428024 hartree
zpe.sumelectzpe: -1023.112925 hartree
zpe.sumelectthermal: -1023.089334 hartree
zpe.sumelectthermalent: -1023.088390 hartree
zpe.sumelectthermalfe: -1023.169953 hartree
dipole: 1.6070 -0.5141 -0.3148
dipole: 1.7164
quadrupole: -142.0433 -142.1592 -154.7183
quadrupole: 4.4807 9.2284 4.5707
quadrupole: 4.2636 4.1477 -8.4113 4.4807 9.2284 4.5707
hfenergy: -1023.5979766 hartree
pointgroup: C01 [X(C23H31N1O1)]
dipole: 0.6325126 0.0246328 0.2351947 debye
polarizability: 380.0430439|27.465353|178.6448884|-3.9371398|19.6211085|229.2942265 unknown
InChI: InChI=1S/C23H31NO/c1-24(22-10-4-2-5-11-22)18-8-9-20-14-16-21(17-15-20)19-25-23-12-6-3-7-13-23/h3,6-7,12-17,22H,2,4-5,8-11,18-19H2,1H3
charge 0 multiplicity 1
56 atoms
O  -4.912888 0.075904 -0.257595
N  4.815182 -0.700789 -0.564471
C  6.221007 -0.236553 -0.318844
C  7.232854 -1.408541 -0.253466
C  6.294229 0.559784 1.0128
C  8.66866 -0.909107 0.04155
C  7.721445 1.080307 1.304046
C  8.73844 -0.083317 1.345517
C  3.898518 0.407346 -0.947959
C  4.677849 -1.833223 -1.506598
C  2.448771 0.180904 -0.466657
C  1.488924 1.305427 -0.947711
C  0.054778 1.074637 -0.497997
C  -0.42452 1.603211 0.727469
C  -0.835723 0.290776 -1.276872
C  -1.745212 1.353918 1.160164
C  -2.153201 0.029616 -0.844813
C  -2.62072 0.557271 0.383139
C  -4.013671 0.249444 0.895637
C  -6.245511 -0.283957 0.005461
C  -6.792508 -0.450543 1.30287
C  -7.055981 -0.475042 -1.142051
C  -8.154282 -0.811198 1.437454
C  -8.409283 -0.83353 -0.990103
C  -8.968646 -1.004918 0.300952
H  6.556507 0.44048 -1.152139
H  6.909859 -2.109713 0.543613
H  7.242173 -1.971583 -1.204871
H  5.585153 1.408732 1.001615
H  5.964826 -0.119618 1.824088
H  9.016263 -0.280954 -0.805099
H  9.355668 -1.775939 0.096395
H  7.729824 1.635305 2.262174
H  8.022054 1.800396 0.514397
H  8.504653 -0.740291 2.208503
H  9.764454 0.303023 1.501564
H  3.898705 0.562799 -2.058708
H  4.26978 1.349849 -0.506385
H  5.178548 -2.733888 -1.117361
H  3.607573 -2.079362 -1.61742
H  5.08329 -1.61707 -2.528575
H  2.442436 0.123489 0.637904
H  2.069561 -0.793341 -0.831211
H  1.534284 1.360879 -2.053832
H  1.856628 2.277887 -0.563768
H  0.238545 2.225171 1.34164
H  -0.492386 -0.115164 -2.236852
H  -2.096097 1.788257 2.105191
H  -2.835332 -0.562779 -1.462171
H  -4.015532 -0.689065 1.492159
H  -4.381896 1.071257 1.543698
H  -6.18408 -0.302392 2.199865
H  -6.606966 -0.335947 -2.130442
H  -8.575265 -0.939443 2.441259
H  -9.030222 -0.979548 -1.881086
H  -10.021322 -1.283656 0.415429
