program: Gaussian 09
title: 000209330
version: EM64L-G09RevD.01
frameworkgroup: C1[X(C10H11N3O3S)]
method: RPBEPBE
basis: SDD
operation: Freq
keyword: #p
keyword: freq=noraman
keyword: PBEPBE/SDD
title: #p freq=noraman PBEPBE/SDD
converged: YES YES NO NO
title: Mulliken charges:
elementType: S O O O N N N C C C C C C C C C C H H H H H H H H H H H
charge: 0.965490 -0.618197 -0.551681 -0.560378 -0.193504 -0.245925 -0.033572 0.260238 -0.538843 -0.303910 0.465134 -0.374827 -0.342889 -0.366333 -0.223169 -0.198365 -0.243505 0.291881 0.304310 0.269345 0.337032 0.316475 0.223134 0.293041 0.230976 0.235203 0.235715 0.367122
chargesum: 0.00000
title: Mulliken charges with hydrogens summed into heavy atoms:
elementType: S O O O N N N C C C C C C C C C C
charge: 0.965490 -0.251076 -0.551681 -0.560378 -0.193504 0.091107 -0.033572 0.260238 0.057349 -0.034565 0.465134 -0.058352 -0.119754 -0.073292 0.007807 0.036838 -0.007789
polarizability: 3.27457809e+02 7.52491425e+00 1.57542829e+02 -7.61771475e+00 -6.01587778e+00 9.60404105e+01
1716.lowfreq: -8.5371 -5.0341 0.0016 0.0018 0.0023 1.8238 5.5856 8.2556 34.4881
frequency: -4.3149 5.8397 34.4680 44.3225 59.6700 90.2022 102.9308 117.1822 154.4460 175.1571 213.9833 259.8333 270.9929 286.5065 298.0061 338.5618 396.7259 403.1172 421.5616 437.3549 506.4648 507.4887 547.6252 611.3235 614.0519 630.4817 638.4723 664.0425 692.5459 700.7038 766.0923 770.7672 821.4543 838.7134 849.8557 888.7658 921.0007 927.0886 949.3202 977.0229 987.2134 990.0728 995.2739 1001.2166 1002.4090 1030.5668 1083.4563 1103.4215 1136.1438 1173.7068 1181.5278 1199.7244 1200.6313 1233.3895 1316.2060 1324.1595 1369.2559 1380.2080 1396.3598 1409.7962 1449.5474 1453.2993 1490.6971 1510.0787 1589.9808 1604.7887 1613.2623 3109.7784 3135.5166 3144.8588 3157.1961 3171.2136 3189.8955 3200.6031 3230.1976 3245.6667 3503.1176 3527.9743
redmass: 5.5110 5.4555 7.8679 7.6625 7.3067 8.2503 4.7865 6.2200 1.6469 3.2011 4.0926 4.2351 5.8531 4.3833 5.6624 6.7207 4.6769 2.8546 4.4817 4.8430 6.6764 4.3347 3.0548 3.1902 4.0080 2.1579 4.2932 2.9248 2.0639 4.7278 1.5497 1.8829 7.3960 1.2600 1.4081 2.0240 1.4223 7.0322 2.7712 1.3644 5.8326 1.3419 3.0925 1.3610 3.8503 1.8927 1.5748 1.1584 1.3167 1.0662 1.3875 2.3220 1.3974 1.8306 2.1958 1.3836 3.2516 4.8618 5.7591 5.2306 1.2803 2.3966 2.3226 1.9756 5.7414 6.3706 6.1185 1.0571 1.0852 1.0891 1.0943 1.0994 1.0960 1.1004 1.1205 1.0994 1.0666 1.0770
irintensity: 1.1820 0.9451 0.8092 2.6543 3.4447 6.5203 1.1334 5.5496 61.6575 63.7773 36.1670 11.0964 39.1913 42.9090 41.7016 7.0847 4.7595 0.0553 12.9185 1.7862 182.7995 78.0915 13.5135 3.1040 3.2244 120.8122 2.4194 16.8467 35.5809 18.5313 111.1110 1.8187 20.7566 0.4427 49.2515 43.2693 8.2628 39.7958 79.9853 0.4091 0.3169 45.1673 24.6016 1.3689 2.2459 17.8445 15.0043 141.1503 3.3456 0.8445 15.0406 9.5935 56.5346 10.1444 121.4529 2.5242 8.4593 4.5402 13.0204 192.1985 16.8021 9.2966 78.7334 158.4223 40.3235 13.8473 54.1208 1.6144 3.1773 7.3515 31.2435 17.9215 3.2656 6.2856 0.6079 1.2475 50.1685 64.9628
temp: 298.150 k
press: 1.00000 atm
elementType: 16 8 8 8 7 7 7 6 6 6 6 6 6 6 6 6 6 1 1 1 1 1 1 1 1 1 1 1
symmnumber: 1
zpe: 531001.7 jmol-1
zpe.correction: 0.202248 hartree
zpe.thermalcorrener: 0.218507 hartree
zpe.thermalcorrenthalpy: 0.219451 hartree
zpe.thermalcorrgfe: 0.154933 hartree
zpe.sumelectzpe: -1174.222404 hartree
zpe.sumelectthermal: -1174.206146 hartree
zpe.sumelectthermalent: -1174.205201 hartree
zpe.sumelectthermalfe: -1174.269719 hartree
dipole: -5.1711 -5.4933 -2.3449
dipole: 7.9003
quadrupole: -101.1507 -99.5887 -116.6315
quadrupole: -4.8416 -11.1736 -1.8867
quadrupole: 4.6396 6.2016 -10.8412 -4.8416 -11.1736 -1.8867
hfenergy: -1174.4246521 hartree
pointgroup: C01 [X(C10H11N3O3S1)]
dipole: -1.8521961 -1.5264635 -1.9749459 debye
polarizability: 324.1035161|26.2882399|149.1540346|0.7343655|25.3307133|107.7834976 unknown
InChI: InChI=1S/C10H10N3.HO3S/c1-11-9-7-12-13(8-9)10-5-3-2-4-6-10;1-4(2)3/h2-8,11H,1H2;1H
charge 0 multiplicity 1
28 atoms
S  4.213946 0.643471 0.716716
O  5.895289 0.782021 -0.166711
O  4.262951 -0.599496 1.7663
O  3.83497 2.118331 1.30846
N  -1.267619 0.07366 -0.107573
N  2.141141 -0.747094 -0.975488
N  -0.654079 1.266531 0.289994
C  0.900264 -0.204063 -0.559357
C  3.244137 0.02119 -1.220883
C  -0.354083 -0.830267 -0.625764
C  -2.686429 -0.076658 0.053475
C  0.665344 1.088491 0.01904
C  -3.323631 -1.295352 -0.28358
C  -3.438899 1.012121 0.556116
C  -4.71951 -1.41849 -0.118969
C  -4.832545 0.873492 0.716283
C  -5.481428 -0.337705 0.380145
H  3.074158 1.041272 -1.579782
H  4.136799 -0.492332 -1.592069
H  -0.633791 -1.808033 -1.006432
H  2.276786 -1.753085 -0.846163
H  1.382722 1.86598 0.284053
H  -2.753328 -2.1482 -0.664872
H  -2.92135 1.938887 0.813472
H  -5.209427 -2.362774 -0.379375
H  -5.412508 1.716624 1.106328
H  -6.564211 -0.43889 0.506951
H  6.544932 1.204968 0.463985
